{"text_format":"1","workbook":"xlsx","n_sheets":14,"sheets":["Hinweise","Formular Bundesprogramm","EXCEL-Tabelle per Mail roh","EXCEL-Tabelle per Mail","Werteliste IDENT_LAND","Werteliste ID_FOERDB","Werteliste Gemeindeschlüssel","Werteliste Schulform","antragsberechtigt B","Adressen","Einstellungen","Tabelle1","LK mit Kommunen","Tabelle2"],"not_rendered":{"charts":0,"images":5,"macros":1,"external_links":0,"defined_names":8,"comments":2,"pivot_tables":2},"unopened":[],"bounds":{"document_bytes":16777216,"sheet_cells":100000,"rows_first":2000,"rows_last":500,"rows_between":2000,"halvings":0,"cell_chars":16384,"cell_head_chars":4096},"cells_cut":0,"cells_raw":0,"read":"whole","date_system":"1900"}

{"sheet":"Hinweise","index":0,"n_rows":38,"n_cols":5,"rows_kept":38,"cut":false,"hidden":false,"merged":[]}
[null,"Anmeldeformular für Investitionsmaßnahmen im Rahmen des Kommunalinvestitionsförderungsgesetz (KInvFG) des Bundes"]
[]
[]
[]
[]
[]
[]
[]
[]
[]
[]
[]
[]
[]
[]
[]
[]
[]
[]
[]
[]
[]
[]
[]
[]
[null,null,null,"Hinweis: ","Bitte nur in den grau hinterlegten Feldern Eintragungen vornehmen."]
[null,null,null,null,"Keine Zeilenschaltung oder \"unnötige\" Leerzeichen verwenden, da sonst die Daten nicht in die Datenbank eingelesen werden können."]
[null,null,null,null,"Die anmeldende Kommune und  den Förderbereich bitte im Dropdownmenü auswählen."]
[null,null,null,null,"Landkreise: Weiterhin ist die Belegenheitsgemeinde im Dropdownmenü auszuwählen. (Das Dropdownmenü erscheint nach Auswahl eines antragsberechtigten Landkreises)"]
[null,null,null,null,"Die  blau hinterlegten Felder beinhalten automatische Eintragungen. (Eigene Eintragungen sind nicht möglich.)"]
[null,null,null,null,"Durch Klick auf den Button \"Speichern, Drucken und Versenden\" werden die Daten \"automatisch\" an das Postfach der WIBank versandt."]
[null,null,null,null,"Sollten Sie nach dem Versenden noch Änderungen vornehmen müssen, benutzen Sie bitte das automatisch erzeugte Formular und setzen einen Haken hinter dem Feld \"Änderungsantrag\"."]
[null,null,null,null,"Sofern ein Laufzeitfehler angezeigt wird, klicken Sie bitte auf die Schaltfläche \"Beenden\" und nicht auf \"Debuggen\"."]
[]
[null,null,null,"zum Formular: "]
[]
[]
[null,null,null,"Informationen zu den PC-Einstellungen:"]

{"sheet":"Formular Bundesprogramm","index":1,"n_rows":148,"n_cols":18,"rows_kept":148,"cut":false,"hidden":false,"merged":[[1,0,1,2],[2,0,2,2],[3,0,3,2],[19,1,19,3],[5,1,5,3],[8,1,8,3],[10,1,10,3],[12,1,12,3],[14,1,14,3],[21,1,21,3],[32,1,32,2],[73,0,73,2],[30,1,30,2],[35,2,35,3],[26,1,26,3],[40,2,40,3],[67,2,67,3],[28,1,28,3],[74,0,74,2],[106,0,106,1],[94,1,96,2],[90,0,90,2],[75,0,75,2],[126,1,126,2],[127,1,127,2],[130,1,131,1],[91,0,91,2],[92,0,92,2],[130,0,132,0],[128,1,128,2],[125,1,125,2],[115,1,116,2],[115,0,116,0],[124,1,124,2],[113,2,113,3],[108,2,108,3]]}
[null,"Änderungsantrag ",null,{"$f":"IF($B$17=\"Bitte auswählen!\",\"\",CONCATENATE(\"IDENT \",$B$40,\"B\",$D$5))","v":""},null,null,null,null,false,"Kontrollkästchen Änderungsantrag"]
[null,null,null,{"$f":"IF($I$2=1,D1,\"\")","v":""},null,null,null,null,{"$f":"IF(I1=TRUE,1,0)","v":0},"Kontrollkästchen Änderungsantrag"]
[null,null,null,{"$f":"IF($B$17=\"Bitte auswählen!\",\"\",CONCATENATE($B$40,\"B\",$D$5))","v":""}]
[null,null,null,{"$f":"NOW()","v":"2022-01-21T12:31:36.800"}]
[null,null,null,{"$f":"IF($D$4=\"\",\"----------\",(ROUND((D4*100000),0)))","v":4458252195}]
[null,"Anmeldung von Investitionsmaßnahmen i.R.d. \nKommunalinvestitionsförderungsgesetzes des Bundes"]
[]
["Ansprechpartner"]
["Name"]
[]
["Vorname"]
[]
["Telefon"]
[]
["E-Mail"]
[null,null,null,null,null,null,null,null,null,null,"Dropdown BelegenheitsGKZ"]
["Anmeldender/\nGKZ (erscheint automatisch)",{"$f":"I18","v":"Bitte auswählen!"},null,{"$f":"IF(B17=\"Bitte auswählen!\",\" \",VLOOKUP($B$17,'antragsberechtigt B'!A1:C249,3,FALSE))","v":" "},null,null,null,null,1,1,{"$f":"IF(OR(I17=178,I17=131,I17=132,I17=229,I17=130,I17=209,I17=133,I17=244),1,0)","v":0}]
[null,null,null,null,null,null,null,null,{"$f":"VLOOKUP($I$17,'antragsberechtigt B'!$D$1:$E$249,2,FALSE)","v":"Bitte auswählen!"},{"$f":"VLOOKUP($J$17,'Werteliste IDENT_LAND'!$N$1:$O$470,2,FALSE)","v":0}]
[]
["Landkreis",{"$f":"IF(B17=\"Bitte auswählen!\",\"\",VLOOKUP(B17,'antragsberechtigt B'!A1:B250,2,FALSE))","v":""},null,null,null,null,null,null,1,{"$f":"VLOOKUP($I$17,'antragsberechtigt B'!$D$1:$F$249,3,FALSE)","v":0},{"$f":"EXACT(D17,J20)","v":false}]
[]
["Träger der Maßnahme"]
[]
[]
[]
["Maßnahmenbeschreibung"]
["Förderbereich",{"$f":"I28","v":"Keine Auswahl getroffen!"},null,null,null,null,null,null,1,"Das Feld gehört zum Makro in Zelle B27 und gibt die Nummer der X-ten ausgewählten Zeile an."]
[null,null,null,null,null,null,null,null,{"$f":"VLOOKUP($I$27,'Werteliste ID_FOERDB'!$B$3:$C$13,2)","v":"Keine Auswahl getroffen!"}]
[]
[null,{"$f":"IF(D31=0, \"Bitte geben Sie eine aussagekräftige Kurzbeschreibung ein!\", \"\")","v":"Bitte geben Sie eine aussagekräftige Kurzbeschreibung ein!"},null,"Anzahl der Zeichen max: 255!",null,null,null,null,{"$f":"VLOOKUP($I$27,'Werteliste ID_FOERDB'!$B$3:$E$13,4,FALSE)","v":0},"Verknüpfung in Tabellenblatt \"EXCEL-Tabelle per Mail roh\", Zelle BJ3"]
["Kurzbeschreibung der Maßnahme",null,null,{"$f":"LEN(B31)","v":0}]
[]
["Belegenheitsadresse\n(Straße, Hausnummer)"]
[]
[]
["Belegenheitsadresse \n(PLZ, Ort)"]
[]
["Nur für antragsberechtigte LK!","Belegenheitsgemeinde sortiert nach LK"]
[" Belegenheitsgemeinde\n (GKZ erscheint automatisch nach Auswahl der Belegenheitsgemeinde)",{"$f":"J40","v":0},{"$f":"K40","v":""},null,null,null,null,null,null,1,"Diese drei Felder gehören zum Makro in Zelle B39."]
[null,{"$f":"IF($B$17=\"Bitte auswählen!\",\" \",VLOOKUP($B$17,'antragsberechtigt B'!$A$1:$C$250,3,FALSE))","v":" "},null,null,null,null,null,null,null,{"$f":"VLOOKUP($J$39,'LK mit Kommunen'!C1:E168,3,FALSE)","v":0},{"$f":"IF($K$17=1,VLOOKUP($J$39,'LK mit Kommunen'!C1:E168,2,FALSE),\"\")","v":""}]
["Anzahl der Maßnahmen"]
[]
[]
[]
["Finanzierungsplanung",null,"Vorabfinanzierung durch Öffentlich Private Partnerschaft (ÖPP)",null,null,null,null,null,false,"Kontrollkästchen ÖPP"]
[]
["beantragte Fördermittel (100%)",{"$f":"B49+B51","v":0},null,null,null,null,null,null,{"$f":"IF($I$45=TRUE,1,0)","v":0},"Kontrollkästchen ÖPP"]
[]
["Bundeszuschuss (höchstens 90% der förderfähigen Kosten) in €",null,null,null,null,null,null,null,null,null,"=90%von b47 (beantragte Fördermittel)"]
[]
["Ko-Finanzierung (mind. 10% der förderfähigen Kosten) in €",null,null,null,null,null,null,null,null,null,"=10% von b47"]
[null,4,null,1]
["Eigenmittel  in €",null,null,"förderfähige Kosten"]
[null,"1ß"]
["Drittmittel  in €\n",null,null,{"$f":"$B$57-$B$55","v":0},null,null,null,null,"förderfähige Kosten nicht im Datensatz verknüpft"]
[]
["Summe",{"$f":"B49+B51+B53+B55","v":0}]
[]
[]
[]
["Im Zeitpunkt der Anmeldung geplanter Abruf der Bundesmittel für die Jahre 2022 bis 2023"]
[2019]
[]
[2022]
[]
[2023]
[]
["Summe:",{"$f":"B62+B64+B66","v":0},{"$f":"IF(B68=B49,\"\",IF(B68<B49,\"Summe des geplanten Abrufs der Bundeszuschüsse ist kleiner als die beantragten Bundeszuschüsse.\",\"Summe des geplanten Abrufs der Bundeszuschüsse ist größer als die beantragten Bundeszuschüsse.\"))","v":""}]
[]
[null,null,null,null,null,null,null,null,null,null,"Spende"]
[null,null,null,{"$f":"IF($B$17=\"Bitte auswählen!\",\"\",CONCATENATE(\"IDENT \",$B$40,\"B\",$D$5))","v":""},null,null,null,null,null,null,"vertraglich vereinbart"]
["Erklärung ",null,null,null,null,null,null,null,null,null,"Zuschüsse"]
[]
["Der Maßnahmenträger bestätigt hiermit, dass, soweit ihm die Möglichkeit",null,null,{"$f":"I76","v":0}]
["zum Vorsteuerabzug eröffnet ist, bei den Ausgaben nur die Entgelte",null,null,null,null,null,null,null,false,"Kontrollkästchen Vost"]
["(Preise ohne Umsatzsteuer) zum Ansatz gebracht werden.",null,null,null,null,null,null,null,{"$f":"IF(I75=TRUE,1,0)","v":0},"Kontrollkästchen Vost"]
[]
[]
[]
[]
["Die Gesamtfinanzierung des Projektes ist sichergestellt.",{"$f":"I82","v":0},null,"Eingabe bitte wie folgt vornehmen:\n'TT.MM.JJ",null,null,null,null,false,"Kontrollkästchen Gesamtfinanzierung"]
[null,null,null,null,null,null,null,null,{"$f":"IF(I81=TRUE,1,0)","v":0},"Kontrollkästchen Gesamtfinanzierung"]
["Längerfristige Nutzung nach § 4 Abs. 3 KInvFG ist gewährleistet.",{"$f":"I84","v":0},"Datum voraussichtlicher Maßnahmenbeginn \nlt. Zff. 3.3. FörderRL",null,null,null,null,null,false,"Kontrollkästchen längerfrist. Nutzung"]
[null,null,null,null,null,null,null,null,{"$f":"IF(I83=TRUE,1,0)","v":0},"Kontrollkästchen längerfrist. Nutzung"]
["Doppelförderungsverbot nach § 4 Abs. 1 KInvFG ist beachtet.",{"$f":"I87","v":false},"Datum voraussichtliche\nEndabnahme\n",null,null,null,null,null,false,"Kontrollkästchen Doppelförderungsverbot"]
[null,"#WENN(UND(D83<J83;D83<>\"\");\"frühester Beginn der Maßnahme ist der 01.07.2015\";\"\")","#WENN(K85>J85;\"letztmögliche Endabnahme der Maßnahme ist der 31.12.2018\";\"\")",null,null,null,null,null,{"$f":"IF(I85=TRUE,1,0)","v":0},"Kontrollkästchen Doppelförderungsverbot"]
["Die Grundsätze der Wirtschaft- lichkeit und Sparsamkeit werden eingehalten; erforderliche Wirtschaftlichkeitsuntersuchungen werden durchgeführt und dokumentiert.",{"$f":"I88","v":0},null,null,null,null,null,null,false,"nicht im Datensatz verknüpft"]
[]
["Der Maßnahmenträger bestätigt bei Baumaßnahmen, dass er Eigentümer, Erbbauberechtigter des Grundstücks oder Inhaber eines dinglichen Nutzungsrechts im Sinne der Nr. 1.7 VV zu § 44 LHO ist.",null,null,null,null,null,null,null,null,"nicht im Datensatz verknüpft"]
[null,null,null,null,null,null,null,null,false,"Kontrollkästchen Förderrichtlinie"]
["Der Maßnahmenträger bestätigt hiermit die Einhaltung der Förderrichtlinie und des KInvFG, insbesondere der Gewährleistung der Gesamtfinanzierung des Projektes, der längerfristigen Nutzung und der Beachtung des Doppelförderungsverbots.",null,null,{"$f":"I91","v":0},null,null,null,null,{"$f":"IF($I$90=TRUE,1,0)","v":0},"Kontrollkästchen Förderrichtlinie"]
[]
[]
[]
["Bemerkungen (fakultativ)",null,null,"Anzahl der Zeichen (max. 255)"]
[null,null,null,{"$f":"LEN(B95)","v":0}]
[]
[]
[]
[]
[]
[null,null,null,null,null,null,null,null,null,null,"Spende"]
[]
[]
[]
[]
["Beantragung oder Bewilligung der Maßnahme in einem anderen Förderprogramm",null,"Name des Förderprogrammes"]
[]
["Die mit diesem Formular angemeldete Maßnahme wurde bereits in einem anderen Förderprogramm angemeldet.",null,null,null,null,null,null,null,false,"Kontrollkästchen anderes Programm"]
[null,null,null,null,null,null,null,null,{"$f":"IF($I$109=TRUE,1,0)","v":0},"Kontrollkästchen anderes Programm"]
[]
[null,null,"Die Förderung wurde beantragt bei: (Bitte vollständige Adresse eintragen)"]
[]
[]
[]
["Stand der Bewilligung/\nGründe für die Ablehnung",null,null,"Anzahl der Zeichen (max. 255)"]
[null,null,null,{"$f":"LEN(B116)","v":0}]
[]
[]
[]
[]
["Darüber hinaus wird bestätigt, dass die oben gemachten Angaben mit den Inhalten der an die WIBank am"]
[null,"erstellten und übersanden Excel-Datei übereinstimmen.",null,{"$f":"D4","v":"2022-01-21T12:31:36.800"}]
[null,null,null,"00:00:00"]
["Ort / Datum"]
[]
[null,"1)"]
[null,"2)"]
["Unterzeichner in Druckbuchstaben","Rechtsverbindliche Unterschrift(en) des Anmeldenden"]
[]
[null,"Speichern und Drucken"]
[]
[]
[]
[]
[]
[]
[]
[]
[]
[]
[]
[]
[]
[]
[null,null,null,null,5,6,7,8,9,10,11,11,12,13,14,15,16,17]
[]
[1,2,3,4]

{"sheet":"EXCEL-Tabelle per Mail roh","index":2,"n_rows":28,"n_cols":70,"rows_kept":28,"cut":false,"hidden":true,"merged":[[4,56,4,56]]}
["IDENT_LAND","L_ANSPRECHPARTNER_NAME","L_ANSPRECHPARTNER_VORNAME","L_ANSPRECHPARTNER_TELEFON","L_ANSPRECHPARTNER_E_MAIL","ANMELDENDER","GKZ","LANDKREIS","TRÄGER","BESCHREIBUNG","BEZ_MASSNAME","BELEGENHEIT_STRASSE","BELEGENHEIT_HAUSNR","BELEGENHEIT_PLZ","BELEGENHEIT_ORT","BELEGENHEIT_GKZ","BELEGENHEIT_GEMEINDE","ANZAHL","FOERDMITTEL_BEANTR","ANTEIL_90_80","ANTEIL_10_20","EIGENMITTEL","DRITTMITTEL","SUMME_INVEST_VOL","GESAMTKOSTEN","OEPP","FOERDMITTEL_ABRUF_2016","FOERDMITTEL_ABRUF_2017","FOERDMITTEL_ABRUF_2018","FOERDMITTEL_ABRUF_2019","FOERDMITTEL_ABRUF_2020","FOERDMITTEL_ABRUF_2021","FOERDMITTEL_ABRUF_2022","FOERDMITTEL_ABRUF_2023","FOERDMITTEL_ABRUF_SUM","L_AUFTEILUNG_VOST","CHK_GESAMTFINANZIERUNG","CHK_NACHHALTIGKEIT","CHK_DOPPELFOERDERUNG","MASSNAHMENBEGINN","VORAUS_ENDABNAHME","L_EINHALTUNG_RL","BEMERKUNG","DAT_ABGABE","BERUECK_AND_FOERPROG","NAME_AND_FOERPROG","BEANTR_AND_FOERDPROG","BEMERK_AND_FOERDPROG","WIBank_Zustimmung","WIBank_Prüfer","WIBank_Prüfer_Telefon","WIBank_Datum_Zustimmung","WiBank_Prüfbemerkung","HMDF_SICHTVERMERK","HMDF_PRUEFER","HMDF_PRUEFER_TEL","HMDF_SICHTVERMERK_DAT","HMDF_SICHTVERMERK_BEM","KOMMUNALES_INVVOL","PRUEFVERMERK","FOERDMITTEL_BEANTRAGT","FB","VH_VN"]
[{"$f":"A3","v":""},{"$f":"IF(B3 <> \"Eingabe\", B3, \"\")","v":0},{"$f":"IF(C3 <> \"Eingabe\", C3, \"\")","v":0},{"$f":"IF(D3 <> \"Eingabe\", D3, \"\")","v":0},{"$f":"IF(E3 <> \"Eingabe\", E3, \"\")","v":0},{"$f":"IF(F3<>\"bitte auswählen\", F3, \"\")","v":"Bitte auswählen!"},{"$f":"IF(G3<>\"Gemeindeschlüssel\", G3, \"\")","v":" "},{"$f":"IF(LEN(TRIM(H3))>0,H3,\"\")","v":""},{"$f":"I3","v":0},{"$f":"J3","v":""},{"$f":"IF(ISBLANK(K3),\"\",K3)","v":""},{"$f":"L3","v":0},{"$f":"M3","v":0},{"$f":"N3","v":0},{"$f":"O3","v":0},{"$f":"P3","v":""},{"$f":"IF(Q3<>0, Q3, \"\")","v":""},{"$f":"R3","v":0},{"$f":"INT(100*S3)/100","v":0},{"$f":"INT(100*T3)/100","v":0},{"$f":"INT(100*U3+0.5)/100","v":0},0,0,0,0,0,{"$f":"AA3","v":0},0,0,{"$f":"AD3","v":0},{"$f":"AE3","v":0},{"$f":"AF3","v":0},{"$f":"AG3","v":0},{"$f":"AH3","v":0},0,0,0,0,0,{"$f":"IF(LEFT(AN3, 7)<>\"Eingabe\",AN3,\"\")","v":"00:00:00"},{"$f":"IF(LEFT(AO3, 7)<>\"Eingabe\",AO3,\"\")","v":"00:00:00"},{"$f":"AP3","v":0},{"$f":"IF(LEN(TRIM(AQ3))>0,AQ3,\"\")","v":""},{"$f":"IF(LEFT(AR3, 7)<>\"Versand\",AR3,\"\")","v":"2022-01-21T12:31:36.800"},{"$f":"AS3","v":0},{"$f":"AT3","v":""},{"$f":"AU3","v":""},{"$f":"AV3","v":""},{"$f":"IF(ISBLANK(AW3),\"\",AW3)","v":""},{"$f":"IF(ISBLANK(AX3),\"\",AX3)","v":""},{"$f":"IF(ISBLANK(AY3),\"\",AY3)","v":""},{"$f":"IF(ISBLANK(AZ3),\"\",AZ3)","v":""},{"$f":"IF(ISBLANK(BA3),\"\",BA3)","v":""},null,null,null,null,null,{"$f":"BG3","v":0},null,null,{"$f":"BJ3","v":0},"VH"]
[{"$f":"'Formular Bundesprogramm'!D3","v":""},{"$f":"'Formular Bundesprogramm'!B9","v":0},{"$f":"'Formular Bundesprogramm'!B11","v":0},{"$f":"'Formular Bundesprogramm'!B13","v":0},{"$f":"'Formular Bundesprogramm'!B15","v":0},{"$f":"'Formular Bundesprogramm'!B17","v":"Bitte auswählen!"},{"$f":"'Formular Bundesprogramm'!D$17","v":" "},{"$f":"IF(LEN(TRIM('Formular Bundesprogramm'!B20))>0,'Formular Bundesprogramm'!B20,\"\")","v":""},{"$f":"'Formular Bundesprogramm'!B22","v":0},{"$f":"IF('Formular Bundesprogramm'!B27=\"Keine Auswahl getroffen!\",\"\",'Formular Bundesprogramm'!B27)","v":""},{"$f":"IF(LEN(TRIM('Formular Bundesprogramm'!B31))>0,'Formular Bundesprogramm'!B31,\"\")","v":""},{"$f":"'Formular Bundesprogramm'!B33","v":0},{"$f":"'Formular Bundesprogramm'!D33","v":0},{"$f":"'Formular Bundesprogramm'!B36","v":0},{"$f":"'Formular Bundesprogramm'!C36","v":0},{"$f":"'Formular Bundesprogramm'!C39","v":""},{"$f":"'Formular Bundesprogramm'!B39","v":0},{"$f":"'Formular Bundesprogramm'!B41","v":0},{"$f":"'Formular Bundesprogramm'!B47","v":0},{"$f":"'Formular Bundesprogramm'!B49","v":0},{"$f":"'Formular Bundesprogramm'!B51","v":0},{"$f":"'Formular Bundesprogramm'!B53","v":0},{"$f":"'Formular Bundesprogramm'!B55","v":0},{"$f":"'Formular Bundesprogramm'!B57","v":0},{"$f":"'Formular Bundesprogramm'!D55","v":0},{"$f":"'Formular Bundesprogramm'!I47","v":0},0,0,0,0,0,0,{"$f":"'Formular Bundesprogramm'!B64","v":0},{"$f":"'Formular Bundesprogramm'!B66","v":0},{"$f":"'Formular Bundesprogramm'!B68","v":0},{"$f":"'Formular Bundesprogramm'!I76","v":0},{"$f":"'Formular Bundesprogramm'!I82","v":0},{"$f":"'Formular Bundesprogramm'!I84","v":0},{"$f":"'Formular Bundesprogramm'!I86","v":0},{"$f":"'Formular Bundesprogramm'!D83","v":"00:00:00"},{"$f":"'Formular Bundesprogramm'!D85","v":"00:00:00"},{"$f":"'Formular Bundesprogramm'!I91","v":0},{"$f":"IF(LEN(TRIM('Formular Bundesprogramm'!B95))>0, 'Formular Bundesprogramm'!B95, \"\")","v":""},{"$f":"'Formular Bundesprogramm'!D4","v":"2022-01-21T12:31:36.800"},{"$f":"'Formular Bundesprogramm'!I110","v":0},{"$f":"IF(LEN(TRIM('Formular Bundesprogramm'!C109))>0,'Formular Bundesprogramm'!C109,\"\")","v":""},{"$f":"IF(LEN(TRIM('Formular Bundesprogramm'!C114))>0,'Formular Bundesprogramm'!C114,\"\")","v":""},{"$f":"IF(LEN(TRIM('Formular Bundesprogramm'!B116))>0,'Formular Bundesprogramm'!B116,\"\")","v":""},null,null,null,null,null,null,null,null,null,null,null,null,null,{"$f":"'Formular Bundesprogramm'!I30","v":0}]
[]
[null,null,null,null,null,null,null,null,null,null,null,null,null,null,null,null,null,null,null,null,null,null,null,null,null,null,null,null,null,null,null,null,null,null,null,null,null,null,null,null,null,null,null,null,null,null,null,"umbenannt","umbenannt","In E2 und E3 fest \"B\" reinschreiben, da hier nur Bundesprogramm","In E2 und E3 fest \"B\" reinschreiben, da hier nur Bundesprogramm","In E2 und E3 fest \"B\" reinschreiben, da hier nur Bundesprogramm","In E2 und E3 fest \"B\" reinschreiben, da hier nur Bundesprogramm","In E2 und E3 fest \"B\" reinschreiben, da hier nur Bundesprogramm"]
[]
[null,null,null,null,null,null,null,null,null,null,null,null,null,null,null,null,null,null,null,null,null,null,null,null,null,null,null,null,null,null,null,null,null,null,null,null,null,null,null,null,null,null,null,null,null,null,null,null,null,"#WENN(LÄNGE(GLÄTTEN(E3))>0;E3;\"\")","#WENN(LÄNGE(GLÄTTEN(E3))>0;E3;\"\")","#WENN(LÄNGE(GLÄTTEN(E3))>0;E3;\"\")","#WENN(LÄNGE(GLÄTTEN(E3))>0;E3;\"\")","#WENN(LÄNGE(GLÄTTEN(E3))>0;E3;\"\")"]
[null,null,null,null,null,null,null,null,null,null,null,null,null,null,null,null,null,null,null,null,null,null,null,null,null,null,null,null,null,null,null,null,null,null,null,null,null,null,null,null,null,null,null,null,null,null,null,null,null,"#WENN('Formular Bundesprogramm'!$B$17=\"Bitte auswählen!\";\" \";SVERWEIS('Formular Bundesprogramm'!$B$17;'Werteliste IDENT_LAND'!A1:F7980;4;FALSCH))","#WENN('Formular Bundesprogramm'!$B$17=\"Bitte auswählen!\";\" \";SVERWEIS('Formular Bundesprogramm'!$B$17;'Werteliste IDENT_LAND'!A1:F7980;4;FALSCH))","#WENN('Formular Bundesprogramm'!$B$17=\"Bitte auswählen!\";\" \";SVERWEIS('Formular Bundesprogramm'!$B$17;'Werteliste IDENT_LAND'!A1:F7980;4;FALSCH))","#WENN('Formular Bundesprogramm'!$B$17=\"Bitte auswählen!\";\" \";SVERWEIS('Formular Bundesprogramm'!$B$17;'Werteliste IDENT_LAND'!A1:F7980;4;FALSCH))","#WENN('Formular Bundesprogramm'!$B$17=\"Bitte auswählen!\";\" \";SVERWEIS('Formular Bundesprogramm'!$B$17;'Werteliste IDENT_LAND'!A1:F7980;4;FALSCH))"]
[]
[]
[null,null,null,null,null,null,null,null,null,null,"#WENN(LÄNGE(GLÄTTEN('Formular Bundesprogramm'!B29))>0;'Formular Bundesprogramm'!B31;\"\")",null,null,null,null,null,null,null,null,null,null,null,null,null,null,null,null,null,null,null,null,null,null,null,null,null,null,null,null,null,null,null,null,null,null,null,null,null,null,null,null,null,null,null,null,null,null,"Förderbereich lt. Vorgabe Bund"]
[null,null,null,null,null,null,null,null,null,null,null,null,null,null,null,null,null,null,null,null,null,null,null,null,null,null,null,null,null,null,null,null,null,null,null,null,null,null,null,null,null,null,null,null,null,null,null,null,null,null,null,null,null,null,"Sollen wir hier schon Nummern festlegen? Ist eine ID für einen Förderbereich nötig?"]
[]
["Feldreihenfolge KIP-Datenbank:"]
["IDENT_LAND","L_ANSPRECHPARTNER_NAME","L_ANSPRECHPARTNER_VORNAME","L_ANSPRECHPARTNER_TELEFON","L_ANSPRECHPARTNER_E_MAIL","ANMELDENDER","GKZ","LANDKREIS","TRÄGER","BESCHREIBUNG","BEZ_MASSNAME","BELEGENHEIT_STRASSE","BELEGENHEIT_HAUSNR","BELEGENHEIT_PLZ","BELEGENHEIT_ORT","BELEGENHEIT_GKZ","BELEGENHEIT_GEMEINDE","ANZAHL","FOERDMITTEL_BEANTR","ANTEIL_90_80","ANTEIL_10_20","EIGENMITTEL","DRITTMITTEL","SUMME_INVEST_VOL","GESAMTKOSTEN","OEPP","FOERDMITTEL_ABRUF_2016","FOERDMITTEL_ABRUF_2017","FOERDMITTEL_ABRUF_2018","FOERDMITTEL_ABRUF_2019","FOERDMITTEL_ABRUF_2020","FOERDMITTEL_ABRUF_2021","FOERDMITTEL_ABRUF_2022","FOERDMITTEL_ABRUF_2023","FOERDMITTEL_ABRUF_SUM","L_AUFTEILUNG_VOST","CHK_GESAMTFINANZIERUNG","CHK_NACHHALTIGKEIT","CHK_DOPPELFOERDERUNG","MASSNAHMENBEGINN","VORAUS_ENDABNAHME","L_EINHALTUNG_RL","BEMERKUNG","DAT_ABGABE","BERUECK_AND_FOERPROG","NAME_AND_FOERPROG","BEANTR_AND_FOERDPROG","BEMERK_AND_FOERDPROG","WIBank_Zustimmung","WIBank_Prüfer","WIBank_Prüfer_Telefon","WIBank_Datum_Zustimmung","WiBank_Prüfbemerkung","HMDF_SICHTVERMERK","HMDF_PRUEFER","HMDF_PRUEFER_TEL","HMDF_SICHTVERMERK_DAT","HMDF_SICHTVERMERK_BEM","KOMMUNALES_INVVOL","PRUEFVERMERK","FOERDMITTEL_BEANTRAGT","FB","VH_VN","CHK_KIP1","CHK_KIP1_IDENT","CHK_SCHULENTWPL","KZ_SCHULTRAEGER","KZ_FOERDBER_KIP2","CHK_ENERG_ANF","FOERDFAEHIG_KOSTEN"]
["Feldreihenfolge Tabellenblat EXCEL-Tabelle per Mail:"]
["IDENT_LAND","L_ANSPRECHPARTNER_NAME","L_ANSPRECHPARTNER_VORNAME","L_ANSPRECHPARTNER_TELEFON","L_ANSPRECHPARTNER_E_MAIL","ANMELDENDER","GKZ","LANDKREIS","TRÄGER","BESCHREIBUNG","BEZ_MASSNAME","BELEGENHEIT_STRASSE","BELEGENHEIT_HAUSNR","BELEGENHEIT_PLZ","BELEGENHEIT_ORT","BELEGENHEIT_GKZ","BELEGENHEIT_GEMEINDE","ANZAHL","FOERDMITTEL_BEANTR","ANTEIL_90_80","ANTEIL_10_20","EIGENMITTEL","DRITTMITTEL","SUMME_INVEST_VOL","GESAMTKOSTEN","OEPP","FOERDMITTEL_ABRUF_2016","FOERDMITTEL_ABRUF_2017","FOERDMITTEL_ABRUF_2018","FOERDMITTEL_ABRUF_2019","FOERDMITTEL_ABRUF_2020","FOERDMITTEL_ABRUF_2021","FOERDMITTEL_ABRUF_2022","FOERDMITTEL_ABRUF_2023","FOERDMITTEL_ABRUF_SUM","L_AUFTEILUNG_VOST","CHK_GESAMTFINANZIERUNG","CHK_NACHHALTIGKEIT","CHK_DOPPELFOERDERUNG","MASSNAHMENBEGINN","VORAUS_ENDABNAHME","L_EINHALTUNG_RL","BEMERKUNG","DAT_ABGABE","BERUECK_AND_FOERPROG","NAME_AND_FOERPROG","BEANTR_AND_FOERDPROG","BEMERK_AND_FOERDPROG","WIBank_Zustimmung","WIBank_Prüfer","WIBank_Prüfer_Telefon","WIBank_Datum_Zustimmung","WiBank_Prüfbemerkung","HMDF_SICHTVERMERK","HMDF_PRUEFER","HMDF_PRUEFER_TEL","HMDF_SICHTVERMERK_DAT","HMDF_SICHTVERMERK_BEM","KOMMUNALES_INVVOL","PRUEFVERMERK","FOERDMITTEL_BEANTRAGT","FB","VH_VN"]
[]
[]
["Abgleich der Feldreihenfolge (WAHR = Übereinstimmung):"]
[{"$f":"EXACT(A1,A15)","v":true},{"$f":"EXACT(B1,B15)","v":true},true,true,true,true,true,true,true,true,true,{"$f":"EXACT(L1,L15)","v":true},true,true,{"$f":"EXACT(O1,O15)","v":true},{"$f":"EXACT(P1,P15)","v":true},true,true,true,true,true,true,{"$f":"EXACT(W1,W15)","v":true},true,true,true,true,true,true,true,true,{"$f":"EXACT(AF1,AF15)","v":true},{"$f":"EXACT(AG1,AG15)","v":true},true,true,true,true,true,true,true,true,true,true,true,true,true,true,true,true,true,true,true,true,true,true,true,true,true,true,true,true,true,true]
[{"$f":"EXACT(A15,A17)","v":true},{"$f":"EXACT(B15,B17)","v":true},true,true,true,true,true,true,true,true,true,true,true,{"$f":"EXACT(N15,N17)","v":true},{"$f":"EXACT(O15,O17)","v":true},true,true,true,true,true,true,true,true,true,true,true,true,true,true,true,true,true,true,true,true,true,true,true,true,true,true,true,true,true,true,true,true,{"$f":"EXACT(AV15,AV17)","v":true},true,true,true,true,true,true,true,true,true,true,true,true,true,true,true]
[]
[]
[]
[]
[]
[null,null,null,null,null,null,null,null,null,null,null,null,null,null,null,"zuviel"]

{"sheet":"EXCEL-Tabelle per Mail","index":3,"n_rows":1,"n_cols":63,"rows_kept":1,"cut":false,"hidden":true,"merged":[]}
["IDENT_LAND","L_ANSPRECHPARTNER_NAME","L_ANSPRECHPARTNER_VORNAME","L_ANSPRECHPARTNER_TELEFON","L_ANSPRECHPARTNER_E_MAIL","ANMELDENDER","GKZ","LANDKREIS","TRÄGER","BESCHREIBUNG","BEZ_MASSNAME","BELEGENHEIT_STRASSE","BELEGENHEIT_HAUSNR","BELEGENHEIT_PLZ","BELEGENHEIT_ORT","BELEGENHEIT_GKZ","BELEGENHEIT_GEMEINDE","ANZAHL","FOERDMITTEL_BEANTR","ANTEIL_90_80","ANTEIL_10_20","EIGENMITTEL","DRITTMITTEL","SUMME_INVEST_VOL","GESAMTKOSTEN","OEPP","FOERDMITTEL_ABRUF_2016","FOERDMITTEL_ABRUF_2017","FOERDMITTEL_ABRUF_2018","FOERDMITTEL_ABRUF_2019","FOERDMITTEL_ABRUF_2020","FOERDMITTEL_ABRUF_2021","FOERDMITTEL_ABRUF_2022","FOERDMITTEL_ABRUF_2023","FOERDMITTEL_ABRUF_SUM","L_AUFTEILUNG_VOST","CHK_GESAMTFINANZIERUNG","CHK_NACHHALTIGKEIT","CHK_DOPPELFOERDERUNG","MASSNAHMENBEGINN","VORAUS_ENDABNAHME","L_EINHALTUNG_RL","BEMERKUNG","DAT_ABGABE","BERUECK_AND_FOERPROG","NAME_AND_FOERPROG","BEANTR_AND_FOERDPROG","BEMERK_AND_FOERDPROG","WIBank_Zustimmung","WIBank_Prüfer","WIBank_Prüfer_Telefon","WIBank_Datum_Zustimmung","WiBank_Prüfbemerkung","HMDF_SICHTVERMERK","HMDF_PRUEFER","HMDF_PRUEFER_TEL","HMDF_SICHTVERMERK_DAT","HMDF_SICHTVERMERK_BEM","KOMMUNALES_INVVOL","PRUEFVERMERK","FOERDMITTEL_BEANTRAGT","FB","VH_VN"]

{"sheet":"Werteliste IDENT_LAND","index":4,"n_rows":471,"n_cols":17,"rows_kept":471,"cut":false,"hidden":true,"merged":[]}
["Bitte auswählen!","Zuordnung zu Landkreis oder kreisfreie Stadt","GEMEINDESCHLUESSEL","PROGRAMM","ID_FOERDB",1,"Bitte auswählen!","GEMEINDESCHLUESSEL FÜR IDENT","Bitte auswählen!",1,null,1,"für GKZ Belegenheit",1,null,"-",1]
[null,null,null,null,null,2,"Bitte auswählen!",null,"Bitte auswählen!",null,null,2,null,2,"06411000","Darmstadt",3]
["Darmstadt","Kreisfreie Stadt","06411","B",null,3,"Darmstadt","06411000","Darmstadt",411000,{"$f":"VLOOKUP(J3,Adressen!$F$1:$L$469,7,FALSE)","v":64283},3,null,3,"06412000","Frankfurt am Main",4]
["Frankfurt am Main","Kreisfreie Stadt","06412","B",null,4,"Frankfurt am Main","06412000","Frankfurt am Main",412000,{"$f":"VLOOKUP(J4,Adressen!$F$1:$L$469,7,FALSE)","v":60311},4,null,4,"06413000","Offenbach am Main",5]
["Offenbach am Main","Kreisfreie Stadt","06413","B",null,5,"Offenbach am Main","06413000","Offenbach am Main",413000,{"$f":"VLOOKUP(J5,Adressen!$F$1:$L$469,7,FALSE)","v":63065},5,null,5,"06414000","Wiesbaden",6]
["Wiesbaden","Kreisfreie Stadt","06414","B",null,6,"Wiesbaden","06414000","Wiesbaden",414000,{"$f":"VLOOKUP(J6,Adressen!$F$1:$L$469,7,FALSE)","v":65183},6,null,6,"06431000","LK Bergstraße",8]
[null,null,null,"B",null,7,"Bitte auswählen!",null,"Bitte auswählen!","",null,7,null,7,"06431001","Abtsteinach",9]
["LK Bergstraße","LK Bergstraße","06431","B",null,8,"LK Bergstraße","06431000","LK Bergstraße",431000,{"$f":"VLOOKUP(J8,Adressen!$F$1:$L$469,7,FALSE)","v":64646},8,null,8,"06431002","Bensheim",10]
["Abtsteinach","LK Bergstraße","06431001","B",null,9,"Abtsteinach","06431001","Abtsteinach",431001,{"$f":"VLOOKUP(J9,Adressen!$F$1:$L$469,7,FALSE)","v":69518},9,null,9,"06431003","Biblis",11]
["Bensheim","LK Bergstraße","06431002","B",null,10,"Bensheim","06431002","Bensheim",431002,{"$f":"VLOOKUP(J10,Adressen!$F$1:$L$469,7,FALSE)","v":64625},10,null,10,"06431004","Birkenau",12]
["Biblis","LK Bergstraße","06431003","B",null,11,"Biblis","06431003","Biblis",431003,{"$f":"VLOOKUP(J11,Adressen!$F$1:$L$469,7,FALSE)","v":68647},11,null,11,"06431005","Bürstadt",13]
["Birkenau","LK Bergstraße","06431004","B",null,12,"Birkenau","06431004","Birkenau",431004,{"$f":"VLOOKUP(J12,Adressen!$F$1:$L$469,7,FALSE)","v":69488},12,null,12,"06431006","Einhausen",14]
["Bürstadt","LK Bergstraße","06431005","B",null,13,"Bürstadt","06431005","Bürstadt",431005,{"$f":"VLOOKUP(J13,Adressen!$F$1:$L$469,7,FALSE)","v":68642},13,null,13,"06431007","Fürth",15]
["Einhausen","LK Bergstraße","06431006","B",null,14,"Einhausen","06431006","Einhausen",431006,{"$f":"VLOOKUP(J14,Adressen!$F$1:$L$469,7,FALSE)","v":64683},14,null,14,"06431008","Gorxheimertal",16]
["Fürth","LK Bergstraße","06431007","B",null,15,"Fürth","06431007","Fürth",431007,{"$f":"VLOOKUP(J15,Adressen!$F$1:$L$469,7,FALSE)","v":64658},15,null,15,"06431009","Grasellenbach",17]
["Gorxheimertal","LK Bergstraße","06431008","B",null,16,"Gorxheimertal","06431008","Gorxheimertal",431008,{"$f":"VLOOKUP(J16,Adressen!$F$1:$L$469,7,FALSE)","v":69517},16,null,16,"06431010","Groß-Rohrheim",18]
["Grasellenbach","LK Bergstraße","06431009","B",null,17,"Grasellenbach","06431009","Grasellenbach",431009,{"$f":"VLOOKUP(J17,Adressen!$F$1:$L$469,7,FALSE)","v":64689},17,null,17,"06431011","Heppenheim (Bergstraße)",19]
["Groß-Rohrheim","LK Bergstraße","06431010","B",null,18,"Groß-Rohrheim","06431010","Groß-Rohrheim",431010,{"$f":"VLOOKUP(J18,Adressen!$F$1:$L$469,7,FALSE)","v":68649},18,null,18,"06431012","Hirschhorn (Neckar)",20]
["Heppenheim (Bergstraße)","LK Bergstraße","06431011","B",null,19,"Heppenheim (Bergstraße)","06431011","Heppenheim (Bergstraße)",431011,{"$f":"VLOOKUP(J19,Adressen!$F$1:$L$469,7,FALSE)","v":64646},19,null,19,"06431013","Lampertheim",21]
["Hirschhorn (Neckar)","LK Bergstraße","06431012","B",null,20,"Hirschhorn (Neckar)","06431012","Hirschhorn (Neckar)",431012,{"$f":"VLOOKUP(J20,Adressen!$F$1:$L$469,7,FALSE)","v":69434},20,null,20,"06431014","Lautertal (Odenwald)",22]
["Lampertheim","LK Bergstraße","06431013","B",null,21,"Lampertheim","06431013","Lampertheim",431013,{"$f":"VLOOKUP(J21,Adressen!$F$1:$L$469,7,FALSE)","v":68623},21,null,21,"06431015","Lindenfels",23]
["Lautertal (Odenwald)","LK Bergstraße","06431014","B",null,22,"Lautertal (Odenwald)","06431014","Lautertal (Odenwald)",431014,{"$f":"VLOOKUP(J22,Adressen!$F$1:$L$469,7,FALSE)","v":64686},22,null,22,"06431016","Lorsch",24]
["Lindenfels","LK Bergstraße","06431015","B",null,23,"Lindenfels","06431015","Lindenfels",431015,{"$f":"VLOOKUP(J23,Adressen!$F$1:$L$469,7,FALSE)","v":64678},23,null,23,"06431017","Mörlenbach",25]
["Lorsch","LK Bergstraße","06431016","B",null,24,"Lorsch","06431016","Lorsch",431016,{"$f":"VLOOKUP(J24,Adressen!$F$1:$L$469,7,FALSE)","v":64653},24,null,24,"06431018","Neckarsteinach",26]
["Mörlenbach","LK Bergstraße","06431017","B",null,25,"Mörlenbach","06431017","Mörlenbach",431017,{"$f":"VLOOKUP(J25,Adressen!$F$1:$L$469,7,FALSE)","v":69509},25,null,25,"06431019","Rimbach",27]
["Neckarsteinach","LK Bergstraße","06431018","B",null,26,"Neckarsteinach","06431018","Neckarsteinach",431018,{"$f":"VLOOKUP(J26,Adressen!$F$1:$L$469,7,FALSE)","v":69239},26,null,26,"06431020","Viernheim",28]
["Rimbach","LK Bergstraße","06431019","B",null,27,"Rimbach","06431019","Rimbach",431019,{"$f":"VLOOKUP(J27,Adressen!$F$1:$L$469,7,FALSE)","v":64668},27,null,27,"06431021","Wald-Michelbach",29]
["Viernheim","LK Bergstraße","06431020","B",null,28,"Viernheim","06431020","Viernheim",431020,{"$f":"VLOOKUP(J28,Adressen!$F$1:$L$469,7,FALSE)","v":68519},28,null,28,"06431022","Zwingenberg",30]
["Wald-Michelbach","LK Bergstraße","06431021","B",null,29,"Wald-Michelbach","06431021","Wald-Michelbach",431021,{"$f":"VLOOKUP(J29,Adressen!$F$1:$L$469,7,FALSE)","v":69483},29,null,29,"06432000","LK Darmstadt-Dieburg",32]
["Zwingenberg","LK Bergstraße","06431022","B",null,30,"Zwingenberg","06431022","Zwingenberg",431022,{"$f":"VLOOKUP(J30,Adressen!$F$1:$L$469,7,FALSE)","v":64673},30,null,30,"06432001","Alsbach-Hähnlein",33]
[null,null,null,"B",null,31,"Bitte auswählen!",null,"Bitte auswählen!","",null,31,null,31,"06432002","Babenhausen",34]
["LK Darmstadt-Dieburg","LK Darmstadt-Dieburg","06432","B",null,32,"LK Darmstadt-Dieburg","06432000","LK Darmstadt-Dieburg",432000,{"$f":"VLOOKUP(J32,Adressen!$F$1:$L$469,7,FALSE)","v":64289},32,null,32,"06432003","Bickenbach",35]
["Alsbach-Hähnlein","LK Darmstadt-Dieburg","06432001","B",null,33,"Alsbach-Hähnlein","06432001","Alsbach-Hähnlein",432001,{"$f":"VLOOKUP(J33,Adressen!$F$1:$L$469,7,FALSE)","v":64665},33,null,33,"06432004","Dieburg       ",36]
["Babenhausen","LK Darmstadt-Dieburg","06432002","B",null,34,"Babenhausen","06432002","Babenhausen",432002,{"$f":"VLOOKUP(J34,Adressen!$F$1:$L$469,7,FALSE)","v":64832},34,null,34,"06432005","Eppertshausen",37]
["Bickenbach","LK Darmstadt-Dieburg","06432003","B",null,35,"Bickenbach","06432003","Bickenbach",432003,{"$f":"VLOOKUP(J35,Adressen!$F$1:$L$469,7,FALSE)","v":64404},35,null,35,"06432006","Erzhausen",38]
["Dieburg       ","LK Darmstadt-Dieburg","06432004","B",null,36,"Dieburg       ","06432004","Dieburg       ",432004,{"$f":"VLOOKUP(J36,Adressen!$F$1:$L$469,7,FALSE)","v":64807},36,null,36,"06432007","Fischbachtal",39]
["Eppertshausen","LK Darmstadt-Dieburg","06432005","B",null,37,"Eppertshausen","06432005","Eppertshausen",432005,{"$f":"VLOOKUP(J37,Adressen!$F$1:$L$469,7,FALSE)","v":64859},37,null,37,"06432008","Griesheim",40]
["Erzhausen","LK Darmstadt-Dieburg","06432006","B",null,38,"Erzhausen","06432006","Erzhausen",432006,{"$f":"VLOOKUP(J38,Adressen!$F$1:$L$469,7,FALSE)","v":64390},38,null,38,"06432009","Groß-Bieberau  ",41]
["Fischbachtal","LK Darmstadt-Dieburg","06432007","B",null,39,"Fischbachtal","06432007","Fischbachtal",432007,{"$f":"VLOOKUP(J39,Adressen!$F$1:$L$469,7,FALSE)","v":64405},39,null,39,"06432010","Groß-Umstadt",42]
["Griesheim","LK Darmstadt-Dieburg","06432008","B",null,40,"Griesheim","06432008","Griesheim",432008,{"$f":"VLOOKUP(J40,Adressen!$F$1:$L$469,7,FALSE)","v":64347},40,null,40,"06432011","Groß-Zimmern",43]
["Groß-Bieberau  ","LK Darmstadt-Dieburg","06432009","B",null,41,"Groß-Bieberau  ","06432009","Groß-Bieberau  ",432009,{"$f":"VLOOKUP(J41,Adressen!$F$1:$L$469,7,FALSE)","v":64401},41,null,41,"06432012","Messel         ",44]
["Groß-Umstadt","LK Darmstadt-Dieburg","06432010","B",null,42,"Groß-Umstadt","06432010","Groß-Umstadt",432010,{"$f":"VLOOKUP(J42,Adressen!$F$1:$L$469,7,FALSE)","v":64823},42,null,42,"06432013","Modautal",45]
["Groß-Zimmern","LK Darmstadt-Dieburg","06432011","B",null,43,"Groß-Zimmern","06432011","Groß-Zimmern",432011,{"$f":"VLOOKUP(J43,Adressen!$F$1:$L$469,7,FALSE)","v":64846},43,null,43,"06432014","Mühltal",46]
["Messel         ","LK Darmstadt-Dieburg","06432012","B",null,44,"Messel         ","06432012","Messel         ",432012,{"$f":"VLOOKUP(J44,Adressen!$F$1:$L$469,7,FALSE)","v":64409},44,null,44,"06432015","Münster",47]
["Modautal","LK Darmstadt-Dieburg","06432013","B",null,45,"Modautal","06432013","Modautal",432013,{"$f":"VLOOKUP(J45,Adressen!$F$1:$L$469,7,FALSE)","v":64397},45,null,45,"06432016","Ober-Ramstadt",48]
["Mühltal","LK Darmstadt-Dieburg","06432014","B",null,46,"Mühltal","06432014","Mühltal",432014,{"$f":"VLOOKUP(J46,Adressen!$F$1:$L$469,7,FALSE)","v":64367},46,null,46,"06432017","Otzberg",49]
["Münster","LK Darmstadt-Dieburg","06432015","B",null,47,"Münster","06432015","Münster",432015,{"$f":"VLOOKUP(J47,Adressen!$F$1:$L$469,7,FALSE)","v":64839},47,null,47,"06432018","Pfungstadt",50]
["Ober-Ramstadt","LK Darmstadt-Dieburg","06432016","B",null,48,"Ober-Ramstadt","06432016","Ober-Ramstadt",432016,{"$f":"VLOOKUP(J48,Adressen!$F$1:$L$469,7,FALSE)","v":64372},48,null,48,"06432019","Reinheim",51]
["Otzberg","LK Darmstadt-Dieburg","06432017","B",null,49,"Otzberg","06432017","Otzberg",432017,{"$f":"VLOOKUP(J49,Adressen!$F$1:$L$469,7,FALSE)","v":64853},49,null,49,"06432020","Roßdorf",52]
["Pfungstadt","LK Darmstadt-Dieburg","06432018","B",null,50,"Pfungstadt","06432018","Pfungstadt",432018,{"$f":"VLOOKUP(J50,Adressen!$F$1:$L$469,7,FALSE)","v":64319},50,null,50,"06432021","Schaafheim",53]
["Reinheim","LK Darmstadt-Dieburg","06432019","B",null,51,"Reinheim","06432019","Reinheim",432019,{"$f":"VLOOKUP(J51,Adressen!$F$1:$L$469,7,FALSE)","v":64354},51,null,51,"06432022","Seeheim-Jugenheim",54]
["Roßdorf","LK Darmstadt-Dieburg","06432020","B",null,52,"Roßdorf","06432020","Roßdorf",432020,{"$f":"VLOOKUP(J52,Adressen!$F$1:$L$469,7,FALSE)","v":64380},52,null,52,"06432023","Weiterstadt",55]
["Schaafheim","LK Darmstadt-Dieburg","06432021","B",null,53,"Schaafheim","06432021","Schaafheim",432021,{"$f":"VLOOKUP(J53,Adressen!$F$1:$L$469,7,FALSE)","v":64850},53,null,53,"06433000","LK Groß-Gerau",57]
["Seeheim-Jugenheim","LK Darmstadt-Dieburg","06432022","B",null,54,"Seeheim-Jugenheim","06432022","Seeheim-Jugenheim",432022,{"$f":"VLOOKUP(J54,Adressen!$F$1:$L$469,7,FALSE)","v":64342},54,null,54,"06433001","Biebesheim am Rhein",58]
["Weiterstadt","LK Darmstadt-Dieburg","06432023","B",null,55,"Weiterstadt","06432023","Weiterstadt",432023,{"$f":"VLOOKUP(J55,Adressen!$F$1:$L$469,7,FALSE)","v":64331},55,null,55,"06433002","Bischofsheim",59]
[null,null,null,"B",null,56,"Bitte auswählen!",null,"Bitte auswählen!","",null,56,null,56,"06433003","Büttelborn",60]
["LK Groß-Gerau","LK Groß-Gerau","06433","B",null,57,"LK Groß-Gerau","06433000","LK Groß-Gerau",433000,{"$f":"VLOOKUP(J57,Adressen!$F$1:$L$469,7,FALSE)","v":64521},57,null,57,"06433004","Gernsheim",61]
["Biebesheim am Rhein","LK Groß-Gerau","06433001","B",null,58,"Biebesheim am Rhein","06433001","Biebesheim am Rhein",433001,{"$f":"VLOOKUP(J58,Adressen!$F$1:$L$469,7,FALSE)","v":64584},58,null,58,"06433005","Ginsheim-Gustavsburg",62]
["Bischofsheim","LK Groß-Gerau","06433002","B",null,59,"Bischofsheim","06433002","Bischofsheim",433002,{"$f":"VLOOKUP(J59,Adressen!$F$1:$L$469,7,FALSE)","v":65474},59,null,59,"06433006","Groß-Gerau     ",63]
["Büttelborn","LK Groß-Gerau","06433003","B",null,60,"Büttelborn","06433003","Büttelborn",433003,{"$f":"VLOOKUP(J60,Adressen!$F$1:$L$469,7,FALSE)","v":64572},60,null,60,"06433007","Kelsterbach    ",64]
["Gernsheim","LK Groß-Gerau","06433004","B",null,61,"Gernsheim","06433004","Gernsheim",433004,{"$f":"VLOOKUP(J61,Adressen!$F$1:$L$469,7,FALSE)","v":64579},61,null,61,"06433008","Mörfelden-Walldorf",65]
["Ginsheim-Gustavsburg","LK Groß-Gerau","06433005","B",null,62,"Ginsheim-Gustavsburg","06433005","Ginsheim-Gustavsburg",433005,{"$f":"VLOOKUP(J62,Adressen!$F$1:$L$469,7,FALSE)","v":65462},62,null,62,"06433009","Nauheim",66]
["Groß-Gerau     ","LK Groß-Gerau","06433006","B",null,63,"Groß-Gerau     ","06433006","Groß-Gerau     ",433006,{"$f":"VLOOKUP(J63,Adressen!$F$1:$L$469,7,FALSE)","v":64521},63,null,63,"06433010","Raunheim",67]
["Kelsterbach    ","LK Groß-Gerau","06433007","B",null,64,"Kelsterbach    ","06433007","Kelsterbach    ",433007,{"$f":"VLOOKUP(J64,Adressen!$F$1:$L$469,7,FALSE)","v":65451},64,null,64,"06433011","Riedstadt",68]
["Mörfelden-Walldorf","LK Groß-Gerau","06433008","B",null,65,"Mörfelden-Walldorf","06433008","Mörfelden-Walldorf",433008,{"$f":"VLOOKUP(J65,Adressen!$F$1:$L$469,7,FALSE)","v":64546},65,null,65,"06433012","Rüsselsheim",69]
["Nauheim","LK Groß-Gerau","06433009","B",null,66,"Nauheim","06433009","Nauheim",433009,{"$f":"VLOOKUP(J66,Adressen!$F$1:$L$469,7,FALSE)","v":64569},66,null,66,"06433013","Stockstadt",70]
["Raunheim","LK Groß-Gerau","06433010","B",null,67,"Raunheim","06433010","Raunheim",433010,{"$f":"VLOOKUP(J67,Adressen!$F$1:$L$469,7,FALSE)","v":65479},67,null,67,"06433014","Trebur         ",71]
["Riedstadt","LK Groß-Gerau","06433011","B",null,68,"Riedstadt","06433011","Riedstadt",433011,{"$f":"VLOOKUP(J68,Adressen!$F$1:$L$469,7,FALSE)","v":64560},68,null,68,"06434000","LK Hochtaunus",73]
["Rüsselsheim","LK Groß-Gerau","06433012","B",null,69,"Rüsselsheim","06433012","Rüsselsheim",433012,{"$f":"VLOOKUP(J69,Adressen!$F$1:$L$469,7,FALSE)","v":65428},69,null,69,"06434001","Bad Homburg v.d.H.",74]
["Stockstadt","LK Groß-Gerau","06433013","B",null,70,"Stockstadt","06433013","Stockstadt",433013,{"$f":"VLOOKUP(J70,Adressen!$F$1:$L$469,7,FALSE)","v":64589},70,null,70,"06434002","Friedrichsdorf",75]
["Trebur         ","LK Groß-Gerau","06433014","B",null,71,"Trebur         ","06433014","Trebur         ",433014,{"$f":"VLOOKUP(J71,Adressen!$F$1:$L$469,7,FALSE)","v":65468},71,null,71,"06434003","Glashütten",76]
[null,null,null,"B",null,72,"Bitte auswählen!",null,"Bitte auswählen!","",null,72,null,72,"06434004","Grävenwiesbach",77]
["LK Hochtaunus","LK Hochtaunus","06434","B",null,73,"LK Hochtaunus","06434000","LK Hochtaunus",434000,{"$f":"VLOOKUP(J73,Adressen!$F$1:$L$469,7,FALSE)","v":61348},73,null,73,"06434005","Königstein im Taunus",78]
["Bad Homburg v.d.H.","LK Hochtaunus","06434001","B",null,74,"Bad Homburg v.d.H.","06434001","Bad Homburg v.d.H.",434001,{"$f":"VLOOKUP(J74,Adressen!$F$1:$L$469,7,FALSE)","v":61348},74,null,74,"06434006","Kronberg       ",79]
["Friedrichsdorf","LK Hochtaunus","06434002","B",null,75,"Friedrichsdorf","06434002","Friedrichsdorf",434002,{"$f":"VLOOKUP(J75,Adressen!$F$1:$L$469,7,FALSE)","v":61381},75,null,75,"06434007","Neu-Anspach",80]
["Glashütten","LK Hochtaunus","06434003","B",null,76,"Glashütten","06434003","Glashütten",434003,{"$f":"VLOOKUP(J76,Adressen!$F$1:$L$469,7,FALSE)","v":61479},76,null,76,"06434008","Oberursel (Taunus)",81]
["Grävenwiesbach","LK Hochtaunus","06434004","B",null,77,"Grävenwiesbach","06434004","Grävenwiesbach",434004,{"$f":"VLOOKUP(J77,Adressen!$F$1:$L$469,7,FALSE)","v":61279},77,null,77,"06434009","Schmitten",82]
["Königstein im Taunus","LK Hochtaunus","06434005","B",null,78,"Königstein im Taunus","06434005","Königstein im Taunus",434005,{"$f":"VLOOKUP(J78,Adressen!$F$1:$L$469,7,FALSE)","v":61462},78,null,78,"06434010","Steinbach (Taunus)",83]
["Kronberg       ","LK Hochtaunus","06434006","B",null,79,"Kronberg       ","06434006","Kronberg       ",434006,{"$f":"VLOOKUP(J79,Adressen!$F$1:$L$469,7,FALSE)","v":61476},79,null,79,"06434011","Usingen",84]
["Neu-Anspach","LK Hochtaunus","06434007","B",null,80,"Neu-Anspach","06434007","Neu-Anspach",434007,{"$f":"VLOOKUP(J80,Adressen!$F$1:$L$469,7,FALSE)","v":61267},80,null,80,"06434012","Wehrheim",85]
["Oberursel (Taunus)","LK Hochtaunus","06434008","B",null,81,"Oberursel (Taunus)","06434008","Oberursel (Taunus)",434008,{"$f":"VLOOKUP(J81,Adressen!$F$1:$L$469,7,FALSE)","v":61440},81,null,81,"06434013","Weilrod",86]
["Schmitten","LK Hochtaunus","06434009","B",null,82,"Schmitten","06434009","Schmitten",434009,{"$f":"VLOOKUP(J82,Adressen!$F$1:$L$469,7,FALSE)","v":61389},82,null,82,"06435000","LK Main-Kinzig",88]
["Steinbach (Taunus)","LK Hochtaunus","06434010","B",null,83,"Steinbach (Taunus)","06434010","Steinbach (Taunus)",434010,{"$f":"VLOOKUP(J83,Adressen!$F$1:$L$469,7,FALSE)","v":61449},83,null,83,"06435001","Bad Orb",89]
["Usingen","LK Hochtaunus","06434011","B",null,84,"Usingen","06434011","Usingen",434011,{"$f":"VLOOKUP(J84,Adressen!$F$1:$L$469,7,FALSE)","v":61250},84,null,84,"06435002","Bad Soden-Salmünster",90]
["Wehrheim","LK Hochtaunus","06434012","B",null,85,"Wehrheim","06434012","Wehrheim",434012,{"$f":"VLOOKUP(J85,Adressen!$F$1:$L$469,7,FALSE)","v":61273},85,null,85,"06435003","Biebergemünd",91]
["Weilrod","LK Hochtaunus","06434013","B",null,86,"Weilrod","06434013","Weilrod",434013,{"$f":"VLOOKUP(J86,Adressen!$F$1:$L$469,7,FALSE)","v":61276},86,null,86,"06435004","Birstein",92]
[null,null,null,"B",null,87,"Bitte auswählen!",null,"Bitte auswählen!","",null,87,null,87,"06435005","Brachttal",93]
["LK Main-Kinzig","LK Main-Kinzig","06435","B",null,88,"LK Main-Kinzig","06435000","LK Main-Kinzig",435000,{"$f":"VLOOKUP(J88,Adressen!$F$1:$L$469,7,FALSE)","v":63569},88,null,88,"06435006","Bruchköbel",94]
["Bad Orb","LK Main-Kinzig","06435001","B",null,89,"Bad Orb","06435001","Bad Orb",435001,{"$f":"VLOOKUP(J89,Adressen!$F$1:$L$469,7,FALSE)","v":63619},89,null,89,"06435007","Erlensee",95]
["Bad Soden-Salmünster","LK Main-Kinzig","06435002","B",null,90,"Bad Soden-Salmünster","06435002","Bad Soden-Salmünster",435002,{"$f":"VLOOKUP(J90,Adressen!$F$1:$L$469,7,FALSE)","v":63628},90,null,90,"06435008","Flörsbachtal",96]
["Biebergemünd","LK Main-Kinzig","06435003","B",null,91,"Biebergemünd","06435003","Biebergemünd",435003,{"$f":"VLOOKUP(J91,Adressen!$F$1:$L$469,7,FALSE)","v":63599},91,null,91,"06435009","Freigericht",97]
["Birstein","LK Main-Kinzig","06435004","B",null,92,"Birstein","06435004","Birstein",435004,{"$f":"VLOOKUP(J92,Adressen!$F$1:$L$469,7,FALSE)","v":63633},92,null,92,"06435010","Gelnhausen",98]
["Brachttal","LK Main-Kinzig","06435005","B",null,93,"Brachttal","06435005","Brachttal",435005,{"$f":"VLOOKUP(J93,Adressen!$F$1:$L$469,7,FALSE)","v":63636},93,null,93,"06435011","Großkrotzenburg",99]
["Bruchköbel","LK Main-Kinzig","06435006","B",null,94,"Bruchköbel","06435006","Bruchköbel",435006,{"$f":"VLOOKUP(J94,Adressen!$F$1:$L$469,7,FALSE)","v":63486},94,null,94,"06435012","Gründau",100]
["Erlensee","LK Main-Kinzig","06435007","B",null,95,"Erlensee","06435007","Erlensee",435007,{"$f":"VLOOKUP(J95,Adressen!$F$1:$L$469,7,FALSE)","v":63526},95,null,95,"06435013","Hammersbach",101]
["Flörsbachtal","LK Main-Kinzig","06435008","B",null,96,"Flörsbachtal","06435008","Flörsbachtal",435008,{"$f":"VLOOKUP(J96,Adressen!$F$1:$L$469,7,FALSE)","v":63639},96,null,96,"06435014","Hanau",102]
["Freigericht","LK Main-Kinzig","06435009","B",null,97,"Freigericht","06435009","Freigericht",435009,{"$f":"VLOOKUP(J97,Adressen!$F$1:$L$469,7,FALSE)","v":63579},97,null,97,"06435015","Hasselroth",103]
["Gelnhausen","LK Main-Kinzig","06435010","B",null,98,"Gelnhausen","06435010","Gelnhausen",435010,{"$f":"VLOOKUP(J98,Adressen!$F$1:$L$469,7,FALSE)","v":63571},98,null,98,"06435016","Jossgrund",104]
["Großkrotzenburg","LK Main-Kinzig","06435011","B",null,99,"Großkrotzenburg","06435011","Großkrotzenburg",435011,{"$f":"VLOOKUP(J99,Adressen!$F$1:$L$469,7,FALSE)","v":63538},99,null,99,"06435017","Langenselbold",105]
["Gründau","LK Main-Kinzig","06435012","B",null,100,"Gründau","06435012","Gründau",435012,{"$f":"VLOOKUP(J100,Adressen!$F$1:$L$469,7,FALSE)","v":63584},100,null,100,"06435018","Linsengericht",106]
["Hammersbach","LK Main-Kinzig","06435013","B",null,101,"Hammersbach","06435013","Hammersbach",435013,{"$f":"VLOOKUP(J101,Adressen!$F$1:$L$469,7,FALSE)","v":63546},101,null,101,"06435019","Maintal",107]
["Hanau","LK Main-Kinzig","06435014","B",null,102,"Hanau","06435014","Hanau",435014,{"$f":"VLOOKUP(J102,Adressen!$F$1:$L$469,7,FALSE)","v":63450},102,null,102,"06435020","Neuberg",108]
["Hasselroth","LK Main-Kinzig","06435015","B",null,103,"Hasselroth","06435015","Hasselroth",435015,{"$f":"VLOOKUP(J103,Adressen!$F$1:$L$469,7,FALSE)","v":63594},103,null,103,"06435021","Nidderau",109]
["Jossgrund","LK Main-Kinzig","06435016","B",null,104,"Jossgrund","06435016","Jossgrund",435016,{"$f":"VLOOKUP(J104,Adressen!$F$1:$L$469,7,FALSE)","v":63637},104,null,104,"06435022","Niederdorfelden",110]
["Langenselbold","LK Main-Kinzig","06435017","B",null,105,"Langenselbold","06435017","Langenselbold",435017,{"$f":"VLOOKUP(J105,Adressen!$F$1:$L$469,7,FALSE)","v":63505},105,null,105,"06435023","Rodenbach",111]
["Linsengericht","LK Main-Kinzig","06435018","B",null,106,"Linsengericht","06435018","Linsengericht",435018,{"$f":"VLOOKUP(J106,Adressen!$F$1:$L$469,7,FALSE)","v":63589},106,null,106,"06435024","Ronneburg",112]
["Maintal","LK Main-Kinzig","06435019","B",null,107,"Maintal","06435019","Maintal",435019,{"$f":"VLOOKUP(J107,Adressen!$F$1:$L$469,7,FALSE)","v":63477},107,null,107,"06435025","Schlüchtern",113]
["Neuberg","LK Main-Kinzig","06435020","B",null,108,"Neuberg","06435020","Neuberg",435020,{"$f":"VLOOKUP(J108,Adressen!$F$1:$L$469,7,FALSE)","v":63543},108,null,108,"06435026","Schöneck",114]
["Nidderau","LK Main-Kinzig","06435021","B",null,109,"Nidderau","06435021","Nidderau",435021,{"$f":"VLOOKUP(J109,Adressen!$F$1:$L$469,7,FALSE)","v":61130},109,null,109,"06435027","Sinntal",115]
["Niederdorfelden","LK Main-Kinzig","06435022","B",null,110,"Niederdorfelden","06435022","Niederdorfelden",435022,{"$f":"VLOOKUP(J110,Adressen!$F$1:$L$469,7,FALSE)","v":61138},110,null,110,"06435028","Steinau an der Straße",116]
["Rodenbach","LK Main-Kinzig","06435023","B",null,111,"Rodenbach","06435023","Rodenbach",435023,{"$f":"VLOOKUP(J111,Adressen!$F$1:$L$469,7,FALSE)","v":63517},111,null,111,"06435029","Wächtersbach",117]
["Ronneburg","LK Main-Kinzig","06435024","B",null,112,"Ronneburg","06435024","Ronneburg",435024,{"$f":"VLOOKUP(J112,Adressen!$F$1:$L$469,7,FALSE)","v":63549},112,null,112,"06436000","LK Main-Taunus",119]
["Schlüchtern","LK Main-Kinzig","06435025","B",null,113,"Schlüchtern","06435025","Schlüchtern",435025,{"$f":"VLOOKUP(J113,Adressen!$F$1:$L$469,7,FALSE)","v":36381},113,null,113,"06436001","Bad Soden am Taunus",120]
["Schöneck","LK Main-Kinzig","06435026","B",null,114,"Schöneck","06435026","Schöneck",435026,{"$f":"VLOOKUP(J114,Adressen!$F$1:$L$469,7,FALSE)","v":61137},114,null,114,"06436002","Eppstein",121]
["Sinntal","LK Main-Kinzig","06435027","B",null,115,"Sinntal","06435027","Sinntal",435027,{"$f":"VLOOKUP(J115,Adressen!$F$1:$L$469,7,FALSE)","v":36391},115,null,115,"06436003","Eschborn       ",122]
["Steinau an der Straße","LK Main-Kinzig","06435028","B",null,116,"Steinau an der Straße","06435028","Steinau an der Straße",435028,{"$f":"VLOOKUP(J116,Adressen!$F$1:$L$469,7,FALSE)","v":36396},116,null,116,"06436004","Flörsheim am Main",123]
["Wächtersbach","LK Main-Kinzig","06435029","B",null,117,"Wächtersbach","06435029","Wächtersbach",435029,{"$f":"VLOOKUP(J117,Adressen!$F$1:$L$469,7,FALSE)","v":63607},117,null,117,"06436005","Hattersheim am Main",124]
[null,null,null,"B",null,118,"Bitte auswählen!",null,"Bitte auswählen!","",null,118,null,118,"06436006","Hochheim am Main",125]
["LK Main-Taunus","LK Main-Taunus","06436","B",null,119,"LK Main-Taunus","06436000","LK Main-Taunus",436000,{"$f":"VLOOKUP(J119,Adressen!$F$1:$L$469,7,FALSE)","v":65719},119,null,119,"06436007","Hofheim am Taunus",126]
["Bad Soden am Taunus","LK Main-Taunus","06436001","B",null,120,"Bad Soden am Taunus","06436001","Bad Soden am Taunus",436001,{"$f":"VLOOKUP(J120,Adressen!$F$1:$L$469,7,FALSE)","v":65812},120,null,120,"06436008","Kelkheim (Taunus)",127]
["Eppstein","LK Main-Taunus","06436002","B",null,121,"Eppstein","06436002","Eppstein",436002,{"$f":"VLOOKUP(J121,Adressen!$F$1:$L$469,7,FALSE)","v":65817},121,null,121,"06436009","Kriftel",128]
["Eschborn       ","LK Main-Taunus","06436003","B",null,122,"Eschborn       ","06436003","Eschborn       ",436003,{"$f":"VLOOKUP(J122,Adressen!$F$1:$L$469,7,FALSE)","v":65760},122,null,122,"06436010","Liederbach am Taunus",129]
["Flörsheim am Main","LK Main-Taunus","06436004","B",null,123,"Flörsheim am Main","06436004","Flörsheim am Main",436004,{"$f":"VLOOKUP(J123,Adressen!$F$1:$L$469,7,FALSE)","v":65439},123,null,123,"06436011","Schwalbach     ",130]
["Hattersheim am Main","LK Main-Taunus","06436005","B",null,124,"Hattersheim am Main","06436005","Hattersheim am Main",436005,{"$f":"VLOOKUP(J124,Adressen!$F$1:$L$469,7,FALSE)","v":65795},124,null,124,"06436012","Sulzbach       ",131]
["Hochheim am Main","LK Main-Taunus","06436006","B",null,125,"Hochheim am Main","06436006","Hochheim am Main",436006,{"$f":"VLOOKUP(J125,Adressen!$F$1:$L$469,7,FALSE)","v":65239},125,null,125,"06437000","LK Odenwald",133]
["Hofheim am Taunus","LK Main-Taunus","06436007","B",null,126,"Hofheim am Taunus","06436007","Hofheim am Taunus",436007,{"$f":"VLOOKUP(J126,Adressen!$F$1:$L$469,7,FALSE)","v":65719},126,null,126,"06437001","Bad König",134]
["Kelkheim (Taunus)","LK Main-Taunus","06436008","B",null,127,"Kelkheim (Taunus)","06436008","Kelkheim (Taunus)",436008,{"$f":"VLOOKUP(J127,Adressen!$F$1:$L$469,7,FALSE)","v":65779},127,null,127,"06437002","Beerfelden     ",135]
["Kriftel","LK Main-Taunus","06436009","B",null,128,"Kriftel","06436009","Kriftel",436009,{"$f":"VLOOKUP(J128,Adressen!$F$1:$L$469,7,FALSE)","v":65830},128,null,128,"06437003","Brensbach",136]
["Liederbach am Taunus","LK Main-Taunus","06436010","B",null,129,"Liederbach am Taunus","06436010","Liederbach am Taunus",436010,{"$f":"VLOOKUP(J129,Adressen!$F$1:$L$469,7,FALSE)","v":65835},129,null,129,"06437004","Breuberg",137]
["Schwalbach     ","LK Main-Taunus","06436011","B",null,130,"Schwalbach     ","06436011","Schwalbach     ",436011,{"$f":"VLOOKUP(J130,Adressen!$F$1:$L$469,7,FALSE)","v":65824},130,null,130,"06437005","Brombachtal",138]
["Sulzbach       ","LK Main-Taunus","06436012","B",null,131,"Sulzbach       ","06436012","Sulzbach       ",436012,{"$f":"VLOOKUP(J131,Adressen!$F$1:$L$469,7,FALSE)","v":65843},131,null,131,"06437006","Erbach",139]
[null,null,null,"B",null,132,"Bitte auswählen!",null,"Bitte auswählen!","",null,132,null,132,"06437007","Fränkisch-Crumbach",140]
["LK Odenwald","LK Odenwald","06437","B",null,133,"LK Odenwald","06437000","LK Odenwald",437000,{"$f":"VLOOKUP(J133,Adressen!$F$1:$L$469,7,FALSE)","v":64711},133,null,133,"06437008","Hesseneck",141]
["Bad König","LK Odenwald","06437001","B",null,134,"Bad König","06437001","Bad König",437001,{"$f":"VLOOKUP(J134,Adressen!$F$1:$L$469,7,FALSE)","v":64732},134,null,134,"06437009","Höchst i.Odw.",142]
["Beerfelden     ","LK Odenwald","06437002","B",null,135,"Beerfelden     ","06437002","Beerfelden     ",437002,{"$f":"VLOOKUP(J135,Adressen!$F$1:$L$469,7,FALSE)","v":64743},135,null,135,"06437010","Lützelbach",143]
["Brensbach","LK Odenwald","06437003","B",null,136,"Brensbach","06437003","Brensbach",437003,{"$f":"VLOOKUP(J136,Adressen!$F$1:$L$469,7,FALSE)","v":64395},136,null,136,"06437011","Michelstadt",144]
["Breuberg","LK Odenwald","06437004","B",null,137,"Breuberg","06437004","Breuberg",437004,{"$f":"VLOOKUP(J137,Adressen!$F$1:$L$469,7,FALSE)","v":64747},137,null,137,"06437012","Mossautal",145]
["Brombachtal","LK Odenwald","06437005","B",null,138,"Brombachtal","06437005","Brombachtal",437005,{"$f":"VLOOKUP(J138,Adressen!$F$1:$L$469,7,FALSE)","v":64753},138,null,138,"06437013","Reichelsheim (Odenwald)",146]
["Erbach","LK Odenwald","06437006","B",null,139,"Erbach","06437006","Erbach",437006,{"$f":"VLOOKUP(J139,Adressen!$F$1:$L$469,7,FALSE)","v":64711},139,null,139,"06437014","Rothenberg",147]
["Fränkisch-Crumbach","LK Odenwald","06437007","B",null,140,"Fränkisch-Crumbach","06437007","Fränkisch-Crumbach",437007,{"$f":"VLOOKUP(J140,Adressen!$F$1:$L$469,7,FALSE)","v":64407},140,null,140,"06437015","Sensbachtal",148]
["Hesseneck","LK Odenwald","06437008","B",null,141,"Hesseneck","06437008","Hesseneck",437008,{"$f":"VLOOKUP(J141,Adressen!$F$1:$L$469,7,FALSE)","v":64754},141,null,141,"06438000","LK Offenbach",150]
["Höchst i.Odw.","LK Odenwald","06437009","B",null,142,"Höchst i.Odw.","06437009","Höchst i.Odw.",437009,{"$f":"VLOOKUP(J142,Adressen!$F$1:$L$469,7,FALSE)","v":64739},142,null,142,"06438001","Dietzenbach",151]
["Lützelbach","LK Odenwald","06437010","B",null,143,"Lützelbach","06437010","Lützelbach",437010,{"$f":"VLOOKUP(J143,Adressen!$F$1:$L$469,7,FALSE)","v":64750},143,null,143,"06438002","Dreieich       ",152]
["Michelstadt","LK Odenwald","06437011","B",null,144,"Michelstadt","06437011","Michelstadt",437011,{"$f":"VLOOKUP(J144,Adressen!$F$1:$L$469,7,FALSE)","v":64720},144,null,144,"06438003","Egelsbach      ",153]
["Mossautal","LK Odenwald","06437012","B",null,145,"Mossautal","06437012","Mossautal",437012,{"$f":"VLOOKUP(J145,Adressen!$F$1:$L$469,7,FALSE)","v":64756},145,null,145,"06438004","Hainburg",154]
["Reichelsheim (Odenwald)","LK Odenwald","06437013","B",null,146,"Reichelsheim (Odenwald)","06437013","Reichelsheim (Odenwald)",437013,{"$f":"VLOOKUP(J146,Adressen!$F$1:$L$469,7,FALSE)","v":64385},146,null,146,"06438005","Heusenstamm    ",155]
["Rothenberg","LK Odenwald","06437014","B",null,147,"Rothenberg","06437014","Rothenberg",437014,{"$f":"VLOOKUP(J147,Adressen!$F$1:$L$469,7,FALSE)","v":64757},147,null,147,"06438006","Langen",156]
["Sensbachtal","LK Odenwald","06437015","B",null,148,"Sensbachtal","06437015","Sensbachtal",437015,{"$f":"VLOOKUP(J148,Adressen!$F$1:$L$469,7,FALSE)","v":64759},148,null,148,"06438007","Mainhausen",157]
[null,null,null,"B",null,149,"Bitte auswählen!",null,"Bitte auswählen!","",null,149,null,149,"06438008","Mühlheim am Main",158]
["LK Offenbach","LK Offenbach","06438","B",null,150,"LK Offenbach","06438000","LK Offenbach",438000,{"$f":"VLOOKUP(J150,Adressen!$F$1:$L$469,7,FALSE)","v":63128},150,null,150,"06438009","Neu-Isenburg   ",159]
["Dietzenbach","LK Offenbach","06438001","B",null,151,"Dietzenbach","06438001","Dietzenbach",438001,{"$f":"VLOOKUP(J151,Adressen!$F$1:$L$469,7,FALSE)","v":63128},151,null,151,"06438010","Obertshausen",160]
["Dreieich       ","LK Offenbach","06438002","B",null,152,"Dreieich       ","06438002","Dreieich       ",438002,{"$f":"VLOOKUP(J152,Adressen!$F$1:$L$469,7,FALSE)","v":63303},152,null,152,"06438011","Rodgau",161]
["Egelsbach      ","LK Offenbach","06438003","B",null,153,"Egelsbach      ","06438003","Egelsbach      ",438003,{"$f":"VLOOKUP(J153,Adressen!$F$1:$L$469,7,FALSE)","v":63329},153,null,153,"06438012","Rödermark",162]
["Hainburg","LK Offenbach","06438004","B",null,154,"Hainburg","06438004","Hainburg",438004,{"$f":"VLOOKUP(J154,Adressen!$F$1:$L$469,7,FALSE)","v":63512},154,null,154,"06438013","Seligenstadt",163]
["Heusenstamm    ","LK Offenbach","06438005","B",null,155,"Heusenstamm    ","06438005","Heusenstamm    ",438005,{"$f":"VLOOKUP(J155,Adressen!$F$1:$L$469,7,FALSE)","v":63150},155,null,155,"06439000","LK Rheingau-Taunus",165]
["Langen","LK Offenbach","06438006","B",null,156,"Langen","06438006","Langen",438006,{"$f":"VLOOKUP(J156,Adressen!$F$1:$L$469,7,FALSE)","v":63225},156,null,156,"06439001","Aarbergen",166]
["Mainhausen","LK Offenbach","06438007","B",null,157,"Mainhausen","06438007","Mainhausen",438007,{"$f":"VLOOKUP(J157,Adressen!$F$1:$L$469,7,FALSE)","v":63533},157,null,157,"06439002","Bad Schwalbach",167]
["Mühlheim am Main","LK Offenbach","06438008","B",null,158,"Mühlheim am Main","06438008","Mühlheim am Main",438008,{"$f":"VLOOKUP(J158,Adressen!$F$1:$L$469,7,FALSE)","v":63165},158,null,158,"06439003","Eltville am Rhein",168]
["Neu-Isenburg   ","LK Offenbach","06438009","B",null,159,"Neu-Isenburg   ","06438009","Neu-Isenburg   ",438009,{"$f":"VLOOKUP(J159,Adressen!$F$1:$L$469,7,FALSE)","v":63263},159,null,159,"06439004","Geisenheim",169]
["Obertshausen","LK Offenbach","06438010","B",null,160,"Obertshausen","06438010","Obertshausen",438010,{"$f":"VLOOKUP(J160,Adressen!$F$1:$L$469,7,FALSE)","v":63179},160,null,160,"06439005","Heidenrod",170]
["Rodgau","LK Offenbach","06438011","B",null,161,"Rodgau","06438011","Rodgau",438011,{"$f":"VLOOKUP(J161,Adressen!$F$1:$L$469,7,FALSE)","v":63110},161,null,161,"06439006","Hohenstein",171]
["Rödermark","LK Offenbach","06438012","B",null,162,"Rödermark","06438012","Rödermark",438012,{"$f":"VLOOKUP(J162,Adressen!$F$1:$L$469,7,FALSE)","v":63322},162,null,162,"06439007","Hünstetten",172]
["Seligenstadt","LK Offenbach","06438013","B",null,163,"Seligenstadt","06438013","Seligenstadt",438013,{"$f":"VLOOKUP(J163,Adressen!$F$1:$L$469,7,FALSE)","v":63500},163,null,163,"06439008","Idstein",173]
[null,null,null,"B",null,164,"Bitte auswählen!",null,"Bitte auswählen!","",null,164,null,164,"06439009","Kiedrich",174]
["LK Rheingau-Taunus","LK Rheingau-Taunus","06439","B",null,165,"LK Rheingau-Taunus","06439000","LK Rheingau-Taunus",439000,{"$f":"VLOOKUP(J165,Adressen!$F$1:$L$469,7,FALSE)","v":65307},165,null,165,"06439010","Lorch",175]
["Aarbergen","LK Rheingau-Taunus","06439001","B",null,166,"Aarbergen","06439001","Aarbergen",439001,{"$f":"VLOOKUP(J166,Adressen!$F$1:$L$469,7,FALSE)","v":65326},166,null,166,"06439011","Niedernhausen",176]
["Bad Schwalbach","LK Rheingau-Taunus","06439002","B",null,167,"Bad Schwalbach","06439002","Bad Schwalbach",439002,{"$f":"VLOOKUP(J167,Adressen!$F$1:$L$469,7,FALSE)","v":65307},167,null,167,"06439012","Oestrich-Winkel",177]
["Eltville am Rhein","LK Rheingau-Taunus","06439003","B",null,168,"Eltville am Rhein","06439003","Eltville am Rhein",439003,{"$f":"VLOOKUP(J168,Adressen!$F$1:$L$469,7,FALSE)","v":65343},168,null,168,"06439013","Rüdesheim am Rhein",178]
["Geisenheim","LK Rheingau-Taunus","06439004","B",null,169,"Geisenheim","06439004","Geisenheim",439004,{"$f":"VLOOKUP(J169,Adressen!$F$1:$L$469,7,FALSE)","v":65366},169,null,169,"06439014","Schlangenbad",179]
["Heidenrod","LK Rheingau-Taunus","06439005","B",null,170,"Heidenrod","06439005","Heidenrod",439005,{"$f":"VLOOKUP(J170,Adressen!$F$1:$L$469,7,FALSE)","v":65321},170,null,170,"06439015","Taunusstein",180]
["Hohenstein","LK Rheingau-Taunus","06439006","B",null,171,"Hohenstein","06439006","Hohenstein",439006,{"$f":"VLOOKUP(J171,Adressen!$F$1:$L$469,7,FALSE)","v":65329},171,null,171,"06439016","Waldems",181]
["Hünstetten","LK Rheingau-Taunus","06439007","B",null,172,"Hünstetten","06439007","Hünstetten",439007,{"$f":"VLOOKUP(J172,Adressen!$F$1:$L$469,7,FALSE)","v":65510},172,null,172,"06439017","Walluf",182]
["Idstein","LK Rheingau-Taunus","06439008","B",null,173,"Idstein","06439008","Idstein",439008,{"$f":"VLOOKUP(J173,Adressen!$F$1:$L$469,7,FALSE)","v":65510},173,null,173,"06440000","LK Wetterau",184]
["Kiedrich","LK Rheingau-Taunus","06439009","B",null,174,"Kiedrich","06439009","Kiedrich",439009,{"$f":"VLOOKUP(J174,Adressen!$F$1:$L$469,7,FALSE)","v":65399},174,null,174,"06440001","Altenstadt",185]
["Lorch","LK Rheingau-Taunus","06439010","B",null,175,"Lorch","06439010","Lorch",439010,{"$f":"VLOOKUP(J175,Adressen!$F$1:$L$469,7,FALSE)","v":65391},175,null,175,"06440002","Bad Nauheim",186]
["Niedernhausen","LK Rheingau-Taunus","06439011","B",null,176,"Niedernhausen","06439011","Niedernhausen",439011,{"$f":"VLOOKUP(J176,Adressen!$F$1:$L$469,7,FALSE)","v":65527},176,null,176,"06440003","Bad Vilbel     ",187]
["Oestrich-Winkel","LK Rheingau-Taunus","06439012","B",null,177,"Oestrich-Winkel","06439012","Oestrich-Winkel",439012,{"$f":"VLOOKUP(J177,Adressen!$F$1:$L$469,7,FALSE)","v":65375},177,null,177,"06440004","Büdingen",188]
["Rüdesheim am Rhein","LK Rheingau-Taunus","06439013","B",null,178,"Rüdesheim am Rhein","06439013","Rüdesheim am Rhein",439013,{"$f":"VLOOKUP(J178,Adressen!$F$1:$L$469,7,FALSE)","v":65385},178,null,178,"06440005","Butzbach",189]
["Schlangenbad","LK Rheingau-Taunus","06439014","B",null,179,"Schlangenbad","06439014","Schlangenbad",439014,{"$f":"VLOOKUP(J179,Adressen!$F$1:$L$469,7,FALSE)","v":65388},179,null,179,"06440006","Echzell",190]
["Taunusstein","LK Rheingau-Taunus","06439015","B",null,180,"Taunusstein","06439015","Taunusstein",439015,{"$f":"VLOOKUP(J180,Adressen!$F$1:$L$469,7,FALSE)","v":65232},180,null,180,"06440007","Florstadt",191]
["Waldems","LK Rheingau-Taunus","06439016","B",null,181,"Waldems","06439016","Waldems",439016,{"$f":"VLOOKUP(J181,Adressen!$F$1:$L$469,7,FALSE)","v":65529},181,null,181,"06440008","Friedberg",192]
["Walluf","LK Rheingau-Taunus","06439017","B",null,182,"Walluf","06439017","Walluf",439017,{"$f":"VLOOKUP(J182,Adressen!$F$1:$L$469,7,FALSE)","v":65396},182,null,182,"06440009","Gedern",193]
[null,null,null,"B",null,183,"Bitte auswählen!",null,"Bitte auswählen!","",null,183,null,183,"06440010","Glauburg",194]
["LK Wetterau","LK Wetterau","06440","B",null,184,"LK Wetterau","06440000","LK Wetterau",440000,{"$f":"VLOOKUP(J184,Adressen!$F$1:$L$469,7,FALSE)","v":61169},184,null,184,"06440011","Hirzenhain     ",195]
["Altenstadt","LK Wetterau","06440001","B",null,185,"Altenstadt","06440001","Altenstadt",440001,{"$f":"VLOOKUP(J185,Adressen!$F$1:$L$469,7,FALSE)","v":63674},185,null,185,"06440012","Karben",196]
["Bad Nauheim","LK Wetterau","06440002","B",null,186,"Bad Nauheim","06440002","Bad Nauheim",440002,{"$f":"VLOOKUP(J186,Adressen!$F$1:$L$469,7,FALSE)","v":61231},186,null,186,"06440013","Kefenrod",197]
["Bad Vilbel     ","LK Wetterau","06440003","B",null,187,"Bad Vilbel     ","06440003","Bad Vilbel     ",440003,{"$f":"VLOOKUP(J187,Adressen!$F$1:$L$469,7,FALSE)","v":61118},187,null,187,"06440014","Limeshain",198]
["Büdingen","LK Wetterau","06440004","B",null,188,"Büdingen","06440004","Büdingen",440004,{"$f":"VLOOKUP(J188,Adressen!$F$1:$L$469,7,FALSE)","v":63654},188,null,188,"06440015","Münzenberg",199]
["Butzbach","LK Wetterau","06440005","B",null,189,"Butzbach","06440005","Butzbach",440005,{"$f":"VLOOKUP(J189,Adressen!$F$1:$L$469,7,FALSE)","v":35510},189,null,189,"06440016","Nidda",200]
["Echzell","LK Wetterau","06440006","B",null,190,"Echzell","06440006","Echzell",440006,{"$f":"VLOOKUP(J190,Adressen!$F$1:$L$469,7,FALSE)","v":61209},190,null,190,"06440017","Niddatal",201]
["Florstadt","LK Wetterau","06440007","B",null,191,"Florstadt","06440007","Florstadt",440007,{"$f":"VLOOKUP(J191,Adressen!$F$1:$L$469,7,FALSE)","v":61197},191,null,191,"06440018","Ober-Mörlen",202]
["Friedberg","LK Wetterau","06440008","B",null,192,"Friedberg","06440008","Friedberg",440008,{"$f":"VLOOKUP(J192,Adressen!$F$1:$L$469,7,FALSE)","v":61169},192,null,192,"06440019","Ortenberg",203]
["Gedern","LK Wetterau","06440009","B",null,193,"Gedern","06440009","Gedern",440009,{"$f":"VLOOKUP(J193,Adressen!$F$1:$L$469,7,FALSE)","v":63688},193,null,193,"06440020","Ranstadt",204]
["Glauburg","LK Wetterau","06440010","B",null,194,"Glauburg","06440010","Glauburg",440010,{"$f":"VLOOKUP(J194,Adressen!$F$1:$L$469,7,FALSE)","v":63695},194,null,194,"06440021","Reichelsheim (Wetterau)",205]
["Hirzenhain     ","LK Wetterau","06440011","B",null,195,"Hirzenhain     ","06440011","Hirzenhain     ",440011,{"$f":"VLOOKUP(J195,Adressen!$F$1:$L$469,7,FALSE)","v":63697},195,null,195,"06440022","Rockenberg",206]
["Karben","LK Wetterau","06440012","B",null,196,"Karben","06440012","Karben",440012,{"$f":"VLOOKUP(J196,Adressen!$F$1:$L$469,7,FALSE)","v":61184},196,null,196,"06440023","Rosbach v. d. Höhe",207]
["Kefenrod","LK Wetterau","06440013","B",null,197,"Kefenrod","06440013","Kefenrod",440013,{"$f":"VLOOKUP(J197,Adressen!$F$1:$L$469,7,FALSE)","v":63699},197,null,197,"06440024","Wölfersheim",208]
["Limeshain","LK Wetterau","06440014","B",null,198,"Limeshain","06440014","Limeshain",440014,{"$f":"VLOOKUP(J198,Adressen!$F$1:$L$469,7,FALSE)","v":63694},198,null,198,"06440025","Wöllstadt",209]
["Münzenberg","LK Wetterau","06440015","B",null,199,"Münzenberg","06440015","Münzenberg",440015,{"$f":"VLOOKUP(J199,Adressen!$F$1:$L$469,7,FALSE)","v":35516},199,null,199,"06531000","LK Gießen",211]
["Nidda","LK Wetterau","06440016","B",null,200,"Nidda","06440016","Nidda",440016,{"$f":"VLOOKUP(J200,Adressen!$F$1:$L$469,7,FALSE)","v":63667},200,null,200,"06531001","Allendorf (Lumda)",212]
["Niddatal","LK Wetterau","06440017","B",null,201,"Niddatal","06440017","Niddatal",440017,{"$f":"VLOOKUP(J201,Adressen!$F$1:$L$469,7,FALSE)","v":61194},201,null,201,"06531002","Biebertal",213]
["Ober-Mörlen","LK Wetterau","06440018","B",null,202,"Ober-Mörlen","06440018","Ober-Mörlen",440018,{"$f":"VLOOKUP(J202,Adressen!$F$1:$L$469,7,FALSE)","v":61239},202,null,202,"06531003","Buseck",214]
["Ortenberg","LK Wetterau","06440019","B",null,203,"Ortenberg","06440019","Ortenberg",440019,{"$f":"VLOOKUP(J203,Adressen!$F$1:$L$469,7,FALSE)","v":63683},203,null,203,"06531004","Fernwald",215]
["Ranstadt","LK Wetterau","06440020","B",null,204,"Ranstadt","06440020","Ranstadt",440020,{"$f":"VLOOKUP(J204,Adressen!$F$1:$L$469,7,FALSE)","v":63691},204,null,204,"06531005","Gießen",216]
["Reichelsheim (Wetterau)","LK Wetterau","06440021","B",null,205,"Reichelsheim (Wetterau)","06440021","Reichelsheim (Wetterau)",440021,{"$f":"VLOOKUP(J205,Adressen!$F$1:$L$469,7,FALSE)","v":61203},205,null,205,"06531006","Grünberg",217]
["Rockenberg","LK Wetterau","06440022","B",null,206,"Rockenberg","06440022","Rockenberg",440022,{"$f":"VLOOKUP(J206,Adressen!$F$1:$L$469,7,FALSE)","v":35519},206,null,206,"06531007","Heuchelheim",218]
["Rosbach v. d. Höhe","LK Wetterau","06440023","B",null,207,"Rosbach v. d. Höhe","06440023","Rosbach v. d. Höhe",440023,{"$f":"VLOOKUP(J207,Adressen!$F$1:$L$469,7,FALSE)","v":61191},207,null,207,"06531008","Hungen",219]
["Wölfersheim","LK Wetterau","06440024","B",null,208,"Wölfersheim","06440024","Wölfersheim",440024,{"$f":"VLOOKUP(J208,Adressen!$F$1:$L$469,7,FALSE)","v":61200},208,null,208,"06531009","Langgöns",220]
["Wöllstadt","LK Wetterau","06440025","B",null,209,"Wöllstadt","06440025","Wöllstadt",440025,{"$f":"VLOOKUP(J209,Adressen!$F$1:$L$469,7,FALSE)","v":61206},209,null,209,"06531010","Laubach",221]
[null,null,null,"B",null,210,"Bitte auswählen!",null,"Bitte auswählen!","",null,210,null,210,"06531011","Lich",222]
["LK Gießen","LK Gießen","06531","B",null,211,"LK Gießen","06531000","LK Gießen",531000,{"$f":"VLOOKUP(J211,Adressen!$F$1:$L$469,7,FALSE)","v":35394},211,null,211,"06531012","Linden",223]
["Allendorf (Lumda)","LK Gießen","06531001","B",null,212,"Allendorf (Lumda)","06531001","Allendorf (Lumda)",531001,{"$f":"VLOOKUP(J212,Adressen!$F$1:$L$469,7,FALSE)","v":35469},212,null,212,"06531013","Lollar",224]
["Biebertal","LK Gießen","06531002","B",null,213,"Biebertal","06531002","Biebertal",531002,{"$f":"VLOOKUP(J213,Adressen!$F$1:$L$469,7,FALSE)","v":35444},213,null,213,"06531014","Pohlheim",225]
["Buseck","LK Gießen","06531003","B",null,214,"Buseck","06531003","Buseck",531003,{"$f":"VLOOKUP(J214,Adressen!$F$1:$L$469,7,FALSE)","v":35418},214,null,214,"06531015","Rabenau",226]
["Fernwald","LK Gießen","06531004","B",null,215,"Fernwald","06531004","Fernwald",531004,{"$f":"VLOOKUP(J215,Adressen!$F$1:$L$469,7,FALSE)","v":35463},215,null,215,"06531016","Reiskirchen",227]
["Gießen","LK Gießen","06531005","B",null,216,"Gießen","06531005","Gießen",531005,{"$f":"VLOOKUP(J216,Adressen!$F$1:$L$469,7,FALSE)","v":35390},216,null,216,"06531017","Staufenberg",228]
["Grünberg","LK Gießen","06531006","B",null,217,"Grünberg","06531006","Grünberg",531006,{"$f":"VLOOKUP(J217,Adressen!$F$1:$L$469,7,FALSE)","v":35305},217,null,217,"06531018","Wettenberg",229]
["Heuchelheim","LK Gießen","06531007","B",null,218,"Heuchelheim","06531007","Heuchelheim",531007,{"$f":"VLOOKUP(J218,Adressen!$F$1:$L$469,7,FALSE)","v":35452},218,null,218,"06532000","LK Lahn-Dill",231]
["Hungen","LK Gießen","06531008","B",null,219,"Hungen","06531008","Hungen",531008,{"$f":"VLOOKUP(J219,Adressen!$F$1:$L$469,7,FALSE)","v":35410},219,null,219,"06532001","Aßlar",232]
["Langgöns","LK Gießen","06531009","B",null,220,"Langgöns","06531009","Langgöns",531009,{"$f":"VLOOKUP(J220,Adressen!$F$1:$L$469,7,FALSE)","v":35428},220,null,220,"06532002","Bischoffen",233]
["Laubach","LK Gießen","06531010","B",null,221,"Laubach","06531010","Laubach",531010,{"$f":"VLOOKUP(J221,Adressen!$F$1:$L$469,7,FALSE)","v":35321},221,null,221,"06532003","Braunfels",234]
["Lich","LK Gießen","06531011","B",null,222,"Lich","06531011","Lich",531011,{"$f":"VLOOKUP(J222,Adressen!$F$1:$L$469,7,FALSE)","v":35423},222,null,222,"06532004","Breitscheid",235]
["Linden","LK Gießen","06531012","B",null,223,"Linden","06531012","Linden",531012,{"$f":"VLOOKUP(J223,Adressen!$F$1:$L$469,7,FALSE)","v":35440},223,null,223,"06532005","Dietzhölztal",236]
["Lollar","LK Gießen","06531013","B",null,224,"Lollar","06531013","Lollar",531013,{"$f":"VLOOKUP(J224,Adressen!$F$1:$L$469,7,FALSE)","v":35457},224,null,224,"06532006","Dillenburg",237]
["Pohlheim","LK Gießen","06531014","B",null,225,"Pohlheim","06531014","Pohlheim",531014,{"$f":"VLOOKUP(J225,Adressen!$F$1:$L$469,7,FALSE)","v":35415},225,null,225,"06532007","Driedorf",238]
["Rabenau","LK Gießen","06531015","B",null,226,"Rabenau","06531015","Rabenau",531015,{"$f":"VLOOKUP(J226,Adressen!$F$1:$L$469,7,FALSE)","v":35466},226,null,226,"06532008","Ehringshausen",239]
["Reiskirchen","LK Gießen","06531016","B",null,227,"Reiskirchen","06531016","Reiskirchen",531016,{"$f":"VLOOKUP(J227,Adressen!$F$1:$L$469,7,FALSE)","v":35447},227,null,227,"06532009","Eschenburg",240]
["Staufenberg","LK Gießen","06531017","B",null,228,"Staufenberg","06531017","Staufenberg",531017,{"$f":"VLOOKUP(J228,Adressen!$F$1:$L$469,7,FALSE)","v":35460},228,null,228,"06532010","Greifenstein",241]
["Wettenberg","LK Gießen","06531018","B",null,229,"Wettenberg","06531018","Wettenberg",531018,{"$f":"VLOOKUP(J229,Adressen!$F$1:$L$469,7,FALSE)","v":35435},229,null,229,"06532011","Haiger",242]
[null,null,null,"B",null,230,"Bitte auswählen!",null,"Bitte auswählen!","",null,230,null,230,"06532012","Herborn",243]
["LK Lahn-Dill","LK Lahn-Dill","06532","B",null,231,"LK Lahn-Dill","06532000","LK Lahn-Dill",532000,{"$f":"VLOOKUP(J231,Adressen!$F$1:$L$469,7,FALSE)","v":35576},231,null,231,"06532013","Hohenahr",244]
["Aßlar","LK Lahn-Dill","06532001","B",null,232,"Aßlar","06532001","Aßlar",532001,{"$f":"VLOOKUP(J232,Adressen!$F$1:$L$469,7,FALSE)","v":35614},232,null,232,"06532014","Hüttenberg",245]
["Bischoffen","LK Lahn-Dill","06532002","B",null,233,"Bischoffen","06532002","Bischoffen",532002,{"$f":"VLOOKUP(J233,Adressen!$F$1:$L$469,7,FALSE)","v":35649},233,null,233,"06532015","Lahnau",246]
["Braunfels","LK Lahn-Dill","06532003","B",null,234,"Braunfels","06532003","Braunfels",532003,{"$f":"VLOOKUP(J234,Adressen!$F$1:$L$469,7,FALSE)","v":35619},234,null,234,"06532016","Leun",247]
["Breitscheid","LK Lahn-Dill","06532004","B",null,235,"Breitscheid","06532004","Breitscheid",532004,{"$f":"VLOOKUP(J235,Adressen!$F$1:$L$469,7,FALSE)","v":35767},235,null,235,"06532017","Mittenaar",248]
["Dietzhölztal","LK Lahn-Dill","06532005","B",null,236,"Dietzhölztal","06532005","Dietzhölztal",532005,{"$f":"VLOOKUP(J236,Adressen!$F$1:$L$469,7,FALSE)","v":35716},236,null,236,"06532018","Schöffengrund",249]
["Dillenburg","LK Lahn-Dill","06532006","B",null,237,"Dillenburg","06532006","Dillenburg",532006,{"$f":"VLOOKUP(J237,Adressen!$F$1:$L$469,7,FALSE)","v":35683},237,null,237,"06532019","Siegbach",250]
["Driedorf","LK Lahn-Dill","06532007","B",null,238,"Driedorf","06532007","Driedorf",532007,{"$f":"VLOOKUP(J238,Adressen!$F$1:$L$469,7,FALSE)","v":35759},238,null,238,"06532020","Sinn",251]
["Ehringshausen","LK Lahn-Dill","06532008","B",null,239,"Ehringshausen","06532008","Ehringshausen",532008,{"$f":"VLOOKUP(J239,Adressen!$F$1:$L$469,7,FALSE)","v":35630},239,null,239,"06532021","Solms",252]
["Eschenburg","LK Lahn-Dill","06532009","B",null,240,"Eschenburg","06532009","Eschenburg",532009,{"$f":"VLOOKUP(J240,Adressen!$F$1:$L$469,7,FALSE)","v":35713},240,null,240,"06532022","Waldsolms",253]
["Greifenstein","LK Lahn-Dill","06532010","B",null,241,"Greifenstein","06532010","Greifenstein",532010,{"$f":"VLOOKUP(J241,Adressen!$F$1:$L$469,7,FALSE)","v":35753},241,null,241,"06532023","Wetzlar",254]
["Haiger","LK Lahn-Dill","06532011","B",null,242,"Haiger","06532011","Haiger",532011,{"$f":"VLOOKUP(J242,Adressen!$F$1:$L$469,7,FALSE)","v":35708},242,null,242,"06533000","LK Limburg-Weilburg",256]
["Herborn","LK Lahn-Dill","06532012","B",null,243,"Herborn","06532012","Herborn",532012,{"$f":"VLOOKUP(J243,Adressen!$F$1:$L$469,7,FALSE)","v":35745},243,null,243,"06533001","Beselich",257]
["Hohenahr","LK Lahn-Dill","06532013","B",null,244,"Hohenahr","06532013","Hohenahr",532013,{"$f":"VLOOKUP(J244,Adressen!$F$1:$L$469,7,FALSE)","v":35644},244,null,244,"06533002","Brechen",258]
["Hüttenberg","LK Lahn-Dill","06532014","B",null,245,"Hüttenberg","06532014","Hüttenberg",532014,{"$f":"VLOOKUP(J245,Adressen!$F$1:$L$469,7,FALSE)","v":35625},245,null,245,"06533003","Bad Camberg",259]
["Lahnau","LK Lahn-Dill","06532015","B",null,246,"Lahnau","06532015","Lahnau",532015,{"$f":"VLOOKUP(J246,Adressen!$F$1:$L$469,7,FALSE)","v":35633},246,null,246,"06533004","Dornburg",260]
["Leun","LK Lahn-Dill","06532016","B",null,247,"Leun","06532016","Leun",532016,{"$f":"VLOOKUP(J247,Adressen!$F$1:$L$469,7,FALSE)","v":35638},247,null,247,"06533005","Elbtal",261]
["Mittenaar","LK Lahn-Dill","06532017","B",null,248,"Mittenaar","06532017","Mittenaar",532017,{"$f":"VLOOKUP(J248,Adressen!$F$1:$L$469,7,FALSE)","v":35756},248,null,248,"06533006","Elz",262]
["Schöffengrund","LK Lahn-Dill","06532018","B",null,249,"Schöffengrund","06532018","Schöffengrund",532018,{"$f":"VLOOKUP(J249,Adressen!$F$1:$L$469,7,FALSE)","v":35641},249,null,249,"06533007","Hadamar",263]
["Siegbach","LK Lahn-Dill","06532019","B",null,250,"Siegbach","06532019","Siegbach",532019,{"$f":"VLOOKUP(J250,Adressen!$F$1:$L$469,7,FALSE)","v":35768},250,null,250,"06533008","Hünfelden",264]
["Sinn","LK Lahn-Dill","06532020","B",null,251,"Sinn","06532020","Sinn",532020,{"$f":"VLOOKUP(J251,Adressen!$F$1:$L$469,7,FALSE)","v":35764},251,null,251,"06533009","Limburg an der Lahn",265]
["Solms","LK Lahn-Dill","06532021","B",null,252,"Solms","06532021","Solms",532021,{"$f":"VLOOKUP(J252,Adressen!$F$1:$L$469,7,FALSE)","v":35606},252,null,252,"06533010","Löhnberg",266]
["Waldsolms","LK Lahn-Dill","06532022","B",null,253,"Waldsolms","06532022","Waldsolms",532022,{"$f":"VLOOKUP(J253,Adressen!$F$1:$L$469,7,FALSE)","v":35647},253,null,253,"06533011","Mengerskirchen",267]
["Wetzlar","LK Lahn-Dill","06532023","B",null,254,"Wetzlar","06532023","Wetzlar",532023,{"$f":"VLOOKUP(J254,Adressen!$F$1:$L$469,7,FALSE)","v":35578},254,null,254,"06533012","Merenberg",268]
[null,null,null,"B",null,255,"Bitte auswählen!",null,"Bitte auswählen!","",null,255,null,255,"06533013","Runkel",269]
["LK Limburg-Weilburg","LK Limburg-Weilburg","06533","B",null,256,"LK Limburg-Weilburg","06533000","LK Limburg-Weilburg",533000,{"$f":"VLOOKUP(J256,Adressen!$F$1:$L$469,7,FALSE)","v":65549},256,null,256,"06533014","Selters (Taunus)",270]
["Beselich","LK Limburg-Weilburg","06533001","B",null,257,"Beselich","06533001","Beselich",533001,{"$f":"VLOOKUP(J257,Adressen!$F$1:$L$469,7,FALSE)","v":65614},257,null,257,"06533015","Villmar",271]
["Brechen","LK Limburg-Weilburg","06533002","B",null,258,"Brechen","06533002","Brechen",533002,{"$f":"VLOOKUP(J258,Adressen!$F$1:$L$469,7,FALSE)","v":65611},258,null,258,"06533016","Waldbrunn (Westerwald)",272]
["Bad Camberg","LK Limburg-Weilburg","06533003","B",null,259,"Bad Camberg","06533003","Bad Camberg",533003,{"$f":"VLOOKUP(J259,Adressen!$F$1:$L$469,7,FALSE)","v":65520},259,null,259,"06533017","Weilburg",273]
["Dornburg","LK Limburg-Weilburg","06533004","B",null,260,"Dornburg","06533004","Dornburg",533004,{"$f":"VLOOKUP(J260,Adressen!$F$1:$L$469,7,FALSE)","v":65599},260,null,260,"06533018","Weilmünster",274]
["Elbtal","LK Limburg-Weilburg","06533005","B",null,261,"Elbtal","06533005","Elbtal",533005,{"$f":"VLOOKUP(J261,Adressen!$F$1:$L$469,7,FALSE)","v":65627},261,null,261,"06533019","Weinbach",275]
["Elz","LK Limburg-Weilburg","06533006","B",null,262,"Elz","06533006","Elz",533006,{"$f":"VLOOKUP(J262,Adressen!$F$1:$L$469,7,FALSE)","v":65604},262,null,262,"06534000","LK Marburg-Biedenkopf",277]
["Hadamar","LK Limburg-Weilburg","06533007","B",null,263,"Hadamar","06533007","Hadamar",533007,{"$f":"VLOOKUP(J263,Adressen!$F$1:$L$469,7,FALSE)","v":65589},263,null,263,"06534001","Amöneburg",278]
["Hünfelden","LK Limburg-Weilburg","06533008","B",null,264,"Hünfelden","06533008","Hünfelden",533008,{"$f":"VLOOKUP(J264,Adressen!$F$1:$L$469,7,FALSE)","v":65597},264,null,264,"06534002","Angelburg",279]
["Limburg an der Lahn","LK Limburg-Weilburg","06533009","B",null,265,"Limburg an der Lahn","06533009","Limburg an der Lahn",533009,{"$f":"VLOOKUP(J265,Adressen!$F$1:$L$469,7,FALSE)","v":65549},265,null,265,"06534003","Bad Endbach",280]
["Löhnberg","LK Limburg-Weilburg","06533010","B",null,266,"Löhnberg","06533010","Löhnberg",533010,{"$f":"VLOOKUP(J266,Adressen!$F$1:$L$469,7,FALSE)","v":35792},266,null,266,"06534004","Biedenkopf",281]
["Mengerskirchen","LK Limburg-Weilburg","06533011","B",null,267,"Mengerskirchen","06533011","Mengerskirchen",533011,{"$f":"VLOOKUP(J267,Adressen!$F$1:$L$469,7,FALSE)","v":35794},267,null,267,"06534005","Breidenbach",282]
["Merenberg","LK Limburg-Weilburg","06533012","B",null,268,"Merenberg","06533012","Merenberg",533012,{"$f":"VLOOKUP(J268,Adressen!$F$1:$L$469,7,FALSE)","v":35799},268,null,268,"06534006","Cölbe",283]
["Runkel","LK Limburg-Weilburg","06533013","B",null,269,"Runkel","06533013","Runkel",533013,{"$f":"VLOOKUP(J269,Adressen!$F$1:$L$469,7,FALSE)","v":65594},269,null,269,"06534007","Dautphetal",284]
["Selters (Taunus)","LK Limburg-Weilburg","06533014","B",null,270,"Selters (Taunus)","06533014","Selters (Taunus)",533014,{"$f":"VLOOKUP(J270,Adressen!$F$1:$L$469,7,FALSE)","v":65618},270,null,270,"06534008","Ebsdorfergrund",285]
["Villmar","LK Limburg-Weilburg","06533015","B",null,271,"Villmar","06533015","Villmar",533015,{"$f":"VLOOKUP(J271,Adressen!$F$1:$L$469,7,FALSE)","v":65606},271,null,271,"06534009","Fronhausen",286]
["Waldbrunn (Westerwald)","LK Limburg-Weilburg","06533016","B",null,272,"Waldbrunn (Westerwald)","06533016","Waldbrunn (Westerwald)",533016,{"$f":"VLOOKUP(J272,Adressen!$F$1:$L$469,7,FALSE)","v":65620},272,null,272,"06534010","Gladenbach",287]
["Weilburg","LK Limburg-Weilburg","06533017","B",null,273,"Weilburg","06533017","Weilburg",533017,{"$f":"VLOOKUP(J273,Adressen!$F$1:$L$469,7,FALSE)","v":35781},273,null,273,"06534011","Kirchhain",288]
["Weilmünster","LK Limburg-Weilburg","06533018","B",null,274,"Weilmünster","06533018","Weilmünster",533018,{"$f":"VLOOKUP(J274,Adressen!$F$1:$L$469,7,FALSE)","v":35789},274,null,274,"06534012","Lahntal",289]
["Weinbach","LK Limburg-Weilburg","06533019","B",null,275,"Weinbach","06533019","Weinbach",533019,{"$f":"VLOOKUP(J275,Adressen!$F$1:$L$469,7,FALSE)","v":35796},275,null,275,"06534013","Lohra",290]
[null,null,null,"B",null,276,"Bitte auswählen!",null,"Bitte auswählen!","",null,276,null,276,"06534014","Marburg",291]
["LK Marburg-Biedenkopf","LK Marburg-Biedenkopf","06534","B",null,277,"LK Marburg-Biedenkopf","06534000","LK Marburg-Biedenkopf",534000,{"$f":"VLOOKUP(J277,Adressen!$F$1:$L$469,7,FALSE)","v":35043},277,null,277,"06534015","Münchhausen",292]
["Amöneburg","LK Marburg-Biedenkopf","06534001","B",null,278,"Amöneburg","06534001","Amöneburg",534001,{"$f":"VLOOKUP(J278,Adressen!$F$1:$L$469,7,FALSE)","v":35287},278,null,278,"06534016","Neustadt (Hessen) ",293]
["Angelburg","LK Marburg-Biedenkopf","06534002","B",null,279,"Angelburg","06534002","Angelburg",534002,{"$f":"VLOOKUP(J279,Adressen!$F$1:$L$469,7,FALSE)","v":35719},279,null,279,"06534017","Rauschenberg",294]
["Bad Endbach","LK Marburg-Biedenkopf","06534003","B",null,280,"Bad Endbach","06534003","Bad Endbach",534003,{"$f":"VLOOKUP(J280,Adressen!$F$1:$L$469,7,FALSE)","v":35080},280,null,280,"06534018","Stadtallendorf",295]
["Biedenkopf","LK Marburg-Biedenkopf","06534004","B",null,281,"Biedenkopf","06534004","Biedenkopf",534004,{"$f":"VLOOKUP(J281,Adressen!$F$1:$L$469,7,FALSE)","v":35216},281,null,281,"06534019","Steffenberg",296]
["Breidenbach","LK Marburg-Biedenkopf","06534005","B",null,282,"Breidenbach","06534005","Breidenbach",534005,{"$f":"VLOOKUP(J282,Adressen!$F$1:$L$469,7,FALSE)","v":35236},282,null,282,"06534020","Weimar (Lahn)",297]
["Cölbe","LK Marburg-Biedenkopf","06534006","B",null,283,"Cölbe","06534006","Cölbe",534006,{"$f":"VLOOKUP(J283,Adressen!$F$1:$L$469,7,FALSE)","v":35091},283,null,283,"06534021","Wetter (Hessen)",298]
["Dautphetal","LK Marburg-Biedenkopf","06534007","B",null,284,"Dautphetal","06534007","Dautphetal",534007,{"$f":"VLOOKUP(J284,Adressen!$F$1:$L$469,7,FALSE)","v":35232},284,null,284,"06534022","Wohratal",299]
["Ebsdorfergrund","LK Marburg-Biedenkopf","06534008","B",null,285,"Ebsdorfergrund","06534008","Ebsdorfergrund",534008,{"$f":"VLOOKUP(J285,Adressen!$F$1:$L$469,7,FALSE)","v":35085},285,null,285,"06535000","LK Vogelsberg",301]
["Fronhausen","LK Marburg-Biedenkopf","06534009","B",null,286,"Fronhausen","06534009","Fronhausen",534009,{"$f":"VLOOKUP(J286,Adressen!$F$1:$L$469,7,FALSE)","v":35112},286,null,286,"06535001","Alsfeld",302]
["Gladenbach","LK Marburg-Biedenkopf","06534010","B",null,287,"Gladenbach","06534010","Gladenbach",534010,{"$f":"VLOOKUP(J287,Adressen!$F$1:$L$469,7,FALSE)","v":35075},287,null,287,"06535002","Antrifttal",303]
["Kirchhain","LK Marburg-Biedenkopf","06534011","B",null,288,"Kirchhain","06534011","Kirchhain",534011,{"$f":"VLOOKUP(J288,Adressen!$F$1:$L$469,7,FALSE)","v":35274},288,null,288,"06535003","Feldatal",304]
["Lahntal","LK Marburg-Biedenkopf","06534012","B",null,289,"Lahntal","06534012","Lahntal",534012,{"$f":"VLOOKUP(J289,Adressen!$F$1:$L$469,7,FALSE)","v":35094},289,null,289,"06535004","Freiensteinau",305]
["Lohra","LK Marburg-Biedenkopf","06534013","B",null,290,"Lohra","06534013","Lohra",534013,{"$f":"VLOOKUP(J290,Adressen!$F$1:$L$469,7,FALSE)","v":35102},290,null,290,"06535005","Gemünden (Felda)",306]
["Marburg","LK Marburg-Biedenkopf","06534014","B",null,291,"Marburg","06534014","Marburg",534014,{"$f":"VLOOKUP(J291,Adressen!$F$1:$L$469,7,FALSE)","v":35037},291,null,291,"06535006","Grebenau",307]
["Münchhausen","LK Marburg-Biedenkopf","06534015","B",null,292,"Münchhausen","06534015","Münchhausen",534015,{"$f":"VLOOKUP(J292,Adressen!$F$1:$L$469,7,FALSE)","v":35117},292,null,292,"06535007","Grebenhain",308]
["Neustadt (Hessen) ","LK Marburg-Biedenkopf","06534016","B",null,293,"Neustadt (Hessen) ","06534016","Neustadt (Hessen) ",534016,{"$f":"VLOOKUP(J293,Adressen!$F$1:$L$469,7,FALSE)","v":35279},293,null,293,"06535008","Herbstein",309]
["Rauschenberg","LK Marburg-Biedenkopf","06534017","B",null,294,"Rauschenberg","06534017","Rauschenberg",534017,{"$f":"VLOOKUP(J294,Adressen!$F$1:$L$469,7,FALSE)","v":35282},294,null,294,"06535009","Homberg (Ohm)  ",310]
["Stadtallendorf","LK Marburg-Biedenkopf","06534018","B",null,295,"Stadtallendorf","06534018","Stadtallendorf",534018,{"$f":"VLOOKUP(J295,Adressen!$F$1:$L$469,7,FALSE)","v":35260},295,null,295,"06535010","Kirtorf",311]
["Steffenberg","LK Marburg-Biedenkopf","06534019","B",null,296,"Steffenberg","06534019","Steffenberg",534019,{"$f":"VLOOKUP(J296,Adressen!$F$1:$L$469,7,FALSE)","v":35239},296,null,296,"06535011","Lauterbach (Hessen)",312]
["Weimar (Lahn)","LK Marburg-Biedenkopf","06534020","B",null,297,"Weimar (Lahn)","06534020","Weimar (Lahn)",534020,{"$f":"VLOOKUP(J297,Adressen!$F$1:$L$469,7,FALSE)","v":35096},297,null,297,"06535012","Lautertal (Vogelsberg)",313]
["Wetter (Hessen)","LK Marburg-Biedenkopf","06534021","B",null,298,"Wetter (Hessen)","06534021","Wetter (Hessen)",534021,{"$f":"VLOOKUP(J298,Adressen!$F$1:$L$469,7,FALSE)","v":35083},298,null,298,"06535013","Mücke",314]
["Wohratal","LK Marburg-Biedenkopf","06534022","B",null,299,"Wohratal","06534022","Wohratal",534022,{"$f":"VLOOKUP(J299,Adressen!$F$1:$L$469,7,FALSE)","v":35288},299,null,299,"06535014","Romrod",315]
[null,null,null,"B",null,300,"Bitte auswählen!",null,"Bitte auswählen!","",null,300,null,300,"06535015","Schlitz",316]
["LK Vogelsberg","LK Vogelsberg","06535","B",null,301,"LK Vogelsberg","06535000","LK Vogelsberg",535000,{"$f":"VLOOKUP(J301,Adressen!$F$1:$L$469,7,FALSE)","v":36341},301,null,301,"06535016","Schotten",317]
["Alsfeld","LK Vogelsberg","06535001","B",null,302,"Alsfeld","06535001","Alsfeld",535001,{"$f":"VLOOKUP(J302,Adressen!$F$1:$L$469,7,FALSE)","v":36304},302,null,302,"06535017","Schwalmtal",318]
["Antrifttal","LK Vogelsberg","06535002","B",null,303,"Antrifttal","06535002","Antrifttal",535002,{"$f":"VLOOKUP(J303,Adressen!$F$1:$L$469,7,FALSE)","v":36326},303,null,303,"06535018","Ulrichstein",319]
["Feldatal","LK Vogelsberg","06535003","B",null,304,"Feldatal","06535003","Feldatal",535003,{"$f":"VLOOKUP(J304,Adressen!$F$1:$L$469,7,FALSE)","v":36325},304,null,304,"06535019","Wartenberg",320]
["Freiensteinau","LK Vogelsberg","06535004","B",null,305,"Freiensteinau","06535004","Freiensteinau",535004,{"$f":"VLOOKUP(J305,Adressen!$F$1:$L$469,7,FALSE)","v":36399},305,null,305,"06611000","Kassel",321]
["Gemünden (Felda)","LK Vogelsberg","06535005","B",null,306,"Gemünden (Felda)","06535005","Gemünden (Felda)",535005,{"$f":"VLOOKUP(J306,Adressen!$F$1:$L$469,7,FALSE)","v":35329},306,null,306,"06631000","LK Fulda",323]
["Grebenau","LK Vogelsberg","06535006","B",null,307,"Grebenau","06535006","Grebenau",535006,{"$f":"VLOOKUP(J307,Adressen!$F$1:$L$469,7,FALSE)","v":36323},307,null,307,"06631001","Bad Salzschlirf",324]
["Grebenhain","LK Vogelsberg","06535007","B",null,308,"Grebenhain","06535007","Grebenhain",535007,{"$f":"VLOOKUP(J308,Adressen!$F$1:$L$469,7,FALSE)","v":36355},308,null,308,"06631002","Burghaun",325]
["Herbstein","LK Vogelsberg","06535008","B",null,309,"Herbstein","06535008","Herbstein",535008,{"$f":"VLOOKUP(J309,Adressen!$F$1:$L$469,7,FALSE)","v":36358},309,null,309,"06631003","Dipperz",326]
["Homberg (Ohm)  ","LK Vogelsberg","06535009","B",null,310,"Homberg (Ohm)  ","06535009","Homberg (Ohm)  ",535009,{"$f":"VLOOKUP(J310,Adressen!$F$1:$L$469,7,FALSE)","v":35315},310,null,310,"06631004","Ebersburg",327]
["Kirtorf","LK Vogelsberg","06535010","B",null,311,"Kirtorf","06535010","Kirtorf",535010,{"$f":"VLOOKUP(J311,Adressen!$F$1:$L$469,7,FALSE)","v":36320},311,null,311,"06631005","Ehrenberg (Rhön)",328]
["Lauterbach (Hessen)","LK Vogelsberg","06535011","B",null,312,"Lauterbach (Hessen)","06535011","Lauterbach (Hessen)",535011,{"$f":"VLOOKUP(J312,Adressen!$F$1:$L$469,7,FALSE)","v":36341},312,null,312,"06631006","Eichenzell",329]
["Lautertal (Vogelsberg)","LK Vogelsberg","06535012","B",null,313,"Lautertal (Vogelsberg)","06535012","Lautertal (Vogelsberg)",535012,{"$f":"VLOOKUP(J313,Adressen!$F$1:$L$469,7,FALSE)","v":36369},313,null,313,"06631007","Eiterfeld",330]
["Mücke","LK Vogelsberg","06535013","B",null,314,"Mücke","06535013","Mücke",535013,{"$f":"VLOOKUP(J314,Adressen!$F$1:$L$469,7,FALSE)","v":35325},314,null,314,"06631008","Flieden",331]
["Romrod","LK Vogelsberg","06535014","B",null,315,"Romrod","06535014","Romrod",535014,{"$f":"VLOOKUP(J315,Adressen!$F$1:$L$469,7,FALSE)","v":36329},315,null,315,"06631009","Fulda",332]
["Schlitz","LK Vogelsberg","06535015","B",null,316,"Schlitz","06535015","Schlitz",535015,{"$f":"VLOOKUP(J316,Adressen!$F$1:$L$469,7,FALSE)","v":36110},316,null,316,"06631010","Gersfeld (Rhön)",333]
["Schotten","LK Vogelsberg","06535016","B",null,317,"Schotten","06535016","Schotten",535016,{"$f":"VLOOKUP(J317,Adressen!$F$1:$L$469,7,FALSE)","v":63679},317,null,317,"06631011","Großenlüder",334]
["Schwalmtal","LK Vogelsberg","06535017","B",null,318,"Schwalmtal","06535017","Schwalmtal",535017,{"$f":"VLOOKUP(J318,Adressen!$F$1:$L$469,7,FALSE)","v":36318},318,null,318,"06631012","Hilders",335]
["Ulrichstein","LK Vogelsberg","06535018","B",null,319,"Ulrichstein","06535018","Ulrichstein",535018,{"$f":"VLOOKUP(J319,Adressen!$F$1:$L$469,7,FALSE)","v":35327},319,null,319,"06631013","Hofbieber",336]
["Wartenberg","LK Vogelsberg","06535019","B",null,320,"Wartenberg","06535019","Wartenberg",535019,{"$f":"VLOOKUP(J320,Adressen!$F$1:$L$469,7,FALSE)","v":36367},320,null,320,"06631014","Hosenfeld",337]
["Kassel","","06611","B",null,321,"Kassel","06611000","Kassel",611000,{"$f":"VLOOKUP(J321,Adressen!$F$1:$L$469,7,FALSE)","v":34117},321,null,321,"06631015","Hünfeld",338]
[null,null,null,"B",null,322,"Bitte auswählen!",null,"Bitte auswählen!","",null,322,null,322,"06631016","Kalbach",339]
["LK Fulda","LK Fulda","06631","B",null,323,"LK Fulda","06631000","LK Fulda",631000,{"$f":"VLOOKUP(J323,Adressen!$F$1:$L$469,7,FALSE)","v":36037},323,null,323,"06631017","Künzell",340]
["Bad Salzschlirf","LK Fulda","06631001","B",null,324,"Bad Salzschlirf","06631001","Bad Salzschlirf",631001,{"$f":"VLOOKUP(J324,Adressen!$F$1:$L$469,7,FALSE)","v":36364},324,null,324,"06631018","Neuhof",341]
["Burghaun","LK Fulda","06631002","B",null,325,"Burghaun","06631002","Burghaun",631002,{"$f":"VLOOKUP(J325,Adressen!$F$1:$L$469,7,FALSE)","v":36151},325,null,325,"06631019","Nüsttal",342]
["Dipperz","LK Fulda","06631003","B",null,326,"Dipperz","06631003","Dipperz",631003,{"$f":"VLOOKUP(J326,Adressen!$F$1:$L$469,7,FALSE)","v":36160},326,null,326,"06631020","Petersberg",343]
["Ebersburg","LK Fulda","06631004","B",null,327,"Ebersburg","06631004","Ebersburg",631004,{"$f":"VLOOKUP(J327,Adressen!$F$1:$L$469,7,FALSE)","v":36157},327,null,327,"06631021","Poppenhausen (Wasserkuppe) ",344]
["Ehrenberg (Rhön)","LK Fulda","06631005","B",null,328,"Ehrenberg (Rhön)","06631005","Ehrenberg (Rhön)",631005,{"$f":"VLOOKUP(J328,Adressen!$F$1:$L$469,7,FALSE)","v":36115},328,null,328,"06631022","Rasdorf",345]
["Eichenzell","LK Fulda","06631006","B",null,329,"Eichenzell","06631006","Eichenzell",631006,{"$f":"VLOOKUP(J329,Adressen!$F$1:$L$469,7,FALSE)","v":36124},329,null,329,"06631023","Tann (Rhön)",346]
["Eiterfeld","LK Fulda","06631007","B",null,330,"Eiterfeld","06631007","Eiterfeld",631007,{"$f":"VLOOKUP(J330,Adressen!$F$1:$L$469,7,FALSE)","v":36132},330,null,330,"06632000","LK Hersfeld-Rotenburg",348]
["Flieden","LK Fulda","06631008","B",null,331,"Flieden","06631008","Flieden",631008,{"$f":"VLOOKUP(J331,Adressen!$F$1:$L$469,7,FALSE)","v":36103},331,null,331,"06632001","Alheim",349]
["Fulda","LK Fulda","06631009","B",null,332,"Fulda","06631009","Fulda",631009,{"$f":"VLOOKUP(J332,Adressen!$F$1:$L$469,7,FALSE)","v":36037},332,null,332,"06632002","Bad Hersfeld",350]
["Gersfeld (Rhön)","LK Fulda","06631010","B",null,333,"Gersfeld (Rhön)","06631010","Gersfeld (Rhön)",631010,{"$f":"VLOOKUP(J333,Adressen!$F$1:$L$469,7,FALSE)","v":36129},333,null,333,"06632003","Bebra",351]
["Großenlüder","LK Fulda","06631011","B",null,334,"Großenlüder","06631011","Großenlüder",631011,{"$f":"VLOOKUP(J334,Adressen!$F$1:$L$469,7,FALSE)","v":36137},334,null,334,"06632004","Breitenbach a. Herzberg",352]
["Hilders","LK Fulda","06631012","B",null,335,"Hilders","06631012","Hilders",631012,{"$f":"VLOOKUP(J335,Adressen!$F$1:$L$469,7,FALSE)","v":36115},335,null,335,"06632005","Cornberg",353]
["Hofbieber","LK Fulda","06631013","B",null,336,"Hofbieber","06631013","Hofbieber",631013,{"$f":"VLOOKUP(J336,Adressen!$F$1:$L$469,7,FALSE)","v":36145},336,null,336,"06632006","Friedewald",354]
["Hosenfeld","LK Fulda","06631014","B",null,337,"Hosenfeld","06631014","Hosenfeld",631014,{"$f":"VLOOKUP(J337,Adressen!$F$1:$L$469,7,FALSE)","v":36154},337,null,337,"06632007","Hauneck",355]
["Hünfeld","LK Fulda","06631015","B",null,338,"Hünfeld","06631015","Hünfeld",631015,{"$f":"VLOOKUP(J338,Adressen!$F$1:$L$469,7,FALSE)","v":36088},338,null,338,"06632008","Haunetal",356]
["Kalbach","LK Fulda","06631016","B",null,339,"Kalbach","06631016","Kalbach",631016,{"$f":"VLOOKUP(J339,Adressen!$F$1:$L$469,7,FALSE)","v":36148},339,null,339,"06632009","Heringen (Werra)",357]
["Künzell","LK Fulda","06631017","B",null,340,"Künzell","06631017","Künzell",631017,{"$f":"VLOOKUP(J340,Adressen!$F$1:$L$469,7,FALSE)","v":36093},340,null,340,"06632010","Hohenroda",358]
["Neuhof","LK Fulda","06631018","B",null,341,"Neuhof","06631018","Neuhof",631018,{"$f":"VLOOKUP(J341,Adressen!$F$1:$L$469,7,FALSE)","v":36119},341,null,341,"06632011","Kirchheim",359]
["Nüsttal","LK Fulda","06631019","B",null,342,"Nüsttal","06631019","Nüsttal",631019,{"$f":"VLOOKUP(J342,Adressen!$F$1:$L$469,7,FALSE)","v":36167},342,null,342,"06632012","Ludwigsau",360]
["Petersberg","LK Fulda","06631020","B",null,343,"Petersberg","06631020","Petersberg",631020,{"$f":"VLOOKUP(J343,Adressen!$F$1:$L$469,7,FALSE)","v":36100},343,null,343,"06632013","Nentershausen",361]
["Poppenhausen (Wasserkuppe) ","LK Fulda","06631021","B",null,344,"Poppenhausen (Wasserkuppe) ","06631021","Poppenhausen (Wasserkuppe) ",631021,{"$f":"VLOOKUP(J344,Adressen!$F$1:$L$469,7,FALSE)","v":36163},344,null,344,"06632014","Neuenstein",362]
["Rasdorf","LK Fulda","06631022","B",null,345,"Rasdorf","06631022","Rasdorf",631022,{"$f":"VLOOKUP(J345,Adressen!$F$1:$L$469,7,FALSE)","v":36169},345,null,345,"06632015","Niederaula",363]
["Tann (Rhön)","LK Fulda","06631023","B",null,346,"Tann (Rhön)","06631023","Tann (Rhön)",631023,{"$f":"VLOOKUP(J346,Adressen!$F$1:$L$469,7,FALSE)","v":36142},346,null,346,"06632016","Philippsthal",364]
[null,null,null,"B",null,347,"Bitte auswählen!",null,"Bitte auswählen!","",null,347,null,347,"06632017","Ronshausen",365]
["LK Hersfeld-Rotenburg","LK Hersfeld-Rotenburg","06632","B",null,348,"LK Hersfeld-Rotenburg","06632000","LK Hersfeld-Rotenburg",632000,{"$f":"VLOOKUP(J348,Adressen!$F$1:$L$469,7,FALSE)","v":36251},348,null,348,"06632018","Rotenburg a.d. Fulda",366]
["Alheim","LK Hersfeld-Rotenburg","06632001","B",null,349,"Alheim","06632001","Alheim",632001,{"$f":"VLOOKUP(J349,Adressen!$F$1:$L$469,7,FALSE)","v":36211},349,null,349,"06632019","Schenklengsfeld",367]
["Bad Hersfeld","LK Hersfeld-Rotenburg","06632002","B",null,350,"Bad Hersfeld","06632002","Bad Hersfeld",632002,{"$f":"VLOOKUP(J350,Adressen!$F$1:$L$469,7,FALSE)","v":36251},350,null,350,"06632020","Wildeck",368]
["Bebra","LK Hersfeld-Rotenburg","06632003","B",null,351,"Bebra","06632003","Bebra",632003,{"$f":"VLOOKUP(J351,Adressen!$F$1:$L$469,7,FALSE)","v":36179},351,null,351,"06633000","LK Kassel",370]
["Breitenbach a. Herzberg","LK Hersfeld-Rotenburg","06632004","B",null,352,"Breitenbach a. Herzberg","06632004","Breitenbach a. Herzberg",632004,{"$f":"VLOOKUP(J352,Adressen!$F$1:$L$469,7,FALSE)","v":36287},352,null,352,"06633001","Ahnatal",371]
["Cornberg","LK Hersfeld-Rotenburg","06632005","B",null,353,"Cornberg","06632005","Cornberg",632005,{"$f":"VLOOKUP(J353,Adressen!$F$1:$L$469,7,FALSE)","v":36219},353,null,353,"06633002","Bad Karlshafen",372]
["Friedewald","LK Hersfeld-Rotenburg","06632006","B",null,354,"Friedewald","06632006","Friedewald",632006,{"$f":"VLOOKUP(J354,Adressen!$F$1:$L$469,7,FALSE)","v":36289},354,null,354,"06633003","Baunatal       ",373]
["Hauneck","LK Hersfeld-Rotenburg","06632007","B",null,355,"Hauneck","06632007","Hauneck",632007,{"$f":"VLOOKUP(J355,Adressen!$F$1:$L$469,7,FALSE)","v":36282},355,null,355,"06633004","Breuna",374]
["Haunetal","LK Hersfeld-Rotenburg","06632008","B",null,356,"Haunetal","06632008","Haunetal",632008,{"$f":"VLOOKUP(J356,Adressen!$F$1:$L$469,7,FALSE)","v":36166},356,null,356,"06633005","Calden",375]
["Heringen (Werra)","LK Hersfeld-Rotenburg","06632009","B",null,357,"Heringen (Werra)","06632009","Heringen (Werra)",632009,{"$f":"VLOOKUP(J357,Adressen!$F$1:$L$469,7,FALSE)","v":36266},357,null,357,"06633006","Bad Emstal",376]
["Hohenroda","LK Hersfeld-Rotenburg","06632010","B",null,358,"Hohenroda","06632010","Hohenroda",632010,{"$f":"VLOOKUP(J358,Adressen!$F$1:$L$469,7,FALSE)","v":36284},358,null,358,"06633007","Espenau",377]
["Kirchheim","LK Hersfeld-Rotenburg","06632011","B",null,359,"Kirchheim","06632011","Kirchheim",632011,{"$f":"VLOOKUP(J359,Adressen!$F$1:$L$469,7,FALSE)","v":36275},359,null,359,"06633008","Fuldabrück",378]
["Ludwigsau","LK Hersfeld-Rotenburg","06632012","B",null,360,"Ludwigsau","06632012","Ludwigsau",632012,{"$f":"VLOOKUP(J360,Adressen!$F$1:$L$469,7,FALSE)","v":36251},360,null,360,"06633009","Fuldatal",379]
["Nentershausen","LK Hersfeld-Rotenburg","06632013","B",null,361,"Nentershausen","06632013","Nentershausen",632013,{"$f":"VLOOKUP(J361,Adressen!$F$1:$L$469,7,FALSE)","v":36214},361,null,361,"06633010","Grebenstein",380]
["Neuenstein","LK Hersfeld-Rotenburg","06632014","B",null,362,"Neuenstein","06632014","Neuenstein",632014,{"$f":"VLOOKUP(J362,Adressen!$F$1:$L$469,7,FALSE)","v":36286},362,null,362,"06633011","Habichtswald",381]
["Niederaula","LK Hersfeld-Rotenburg","06632015","B",null,363,"Niederaula","06632015","Niederaula",632015,{"$f":"VLOOKUP(J363,Adressen!$F$1:$L$469,7,FALSE)","v":36272},363,null,363,"06633012","Helsa",382]
["Philippsthal","LK Hersfeld-Rotenburg","06632016","B",null,364,"Philippsthal","06632016","Philippsthal",632016,{"$f":"VLOOKUP(J364,Adressen!$F$1:$L$469,7,FALSE)","v":36269},364,null,364,"06633013","Hofgeismar",383]
["Ronshausen","LK Hersfeld-Rotenburg","06632017","B",null,365,"Ronshausen","06632017","Ronshausen",632017,{"$f":"VLOOKUP(J365,Adressen!$F$1:$L$469,7,FALSE)","v":36217},365,null,365,"06633014","Immenhausen",384]
["Rotenburg a.d. Fulda","LK Hersfeld-Rotenburg","06632018","B",null,366,"Rotenburg a.d. Fulda","06632018","Rotenburg a.d. Fulda",632018,{"$f":"VLOOKUP(J366,Adressen!$F$1:$L$469,7,FALSE)","v":36199},366,null,366,"06633015","Kaufungen",385]
["Schenklengsfeld","LK Hersfeld-Rotenburg","06632019","B",null,367,"Schenklengsfeld","06632019","Schenklengsfeld",632019,{"$f":"VLOOKUP(J367,Adressen!$F$1:$L$469,7,FALSE)","v":36277},367,null,367,"06633016","Liebenau",386]
["Wildeck","LK Hersfeld-Rotenburg","06632020","B",null,368,"Wildeck","06632020","Wildeck",632020,{"$f":"VLOOKUP(J368,Adressen!$F$1:$L$469,7,FALSE)","v":36208},368,null,368,"06633017","Lohfelden",387]
[null,null,null,"B",null,369,"Bitte auswählen!",null,"Bitte auswählen!","",null,369,null,369,"06633018","Naumburg",388]
["LK Kassel","LK Kassel","06633","B",null,370,"LK Kassel","06633000","LK Kassel",633000,{"$f":"VLOOKUP(J370,Adressen!$F$1:$L$469,7,FALSE)","v":34117},370,null,370,"06633019","Nieste",389]
["Ahnatal","LK Kassel","06633001","B",null,371,"Ahnatal","06633001","Ahnatal",633001,{"$f":"VLOOKUP(J371,Adressen!$F$1:$L$469,7,FALSE)","v":34292},371,null,371,"06633020","Niestetal",390]
["Bad Karlshafen","LK Kassel","06633002","B",null,372,"Bad Karlshafen","06633002","Bad Karlshafen",633002,{"$f":"VLOOKUP(J372,Adressen!$F$1:$L$469,7,FALSE)","v":34385},372,null,372,"06633021","Oberweser",391]
["Baunatal       ","LK Kassel","06633003","B",null,373,"Baunatal       ","06633003","Baunatal       ",633003,{"$f":"VLOOKUP(J373,Adressen!$F$1:$L$469,7,FALSE)","v":34225},373,null,373,"06633022","Reinhardshagen",392]
["Breuna","LK Kassel","06633004","B",null,374,"Breuna","06633004","Breuna",633004,{"$f":"VLOOKUP(J374,Adressen!$F$1:$L$469,7,FALSE)","v":34479},374,null,374,"06633023","Schauenburg",393]
["Calden","LK Kassel","06633005","B",null,375,"Calden","06633005","Calden",633005,{"$f":"VLOOKUP(J375,Adressen!$F$1:$L$469,7,FALSE)","v":34379},375,null,375,"06633024","Söhrewald",394]
["Bad Emstal","LK Kassel","06633006","B",null,376,"Bad Emstal","06633006","Bad Emstal",633006,{"$f":"VLOOKUP(J376,Adressen!$F$1:$L$469,7,FALSE)","v":34308},376,null,376,"06633025","Trendelburg",395]
["Espenau","LK Kassel","06633007","B",null,377,"Espenau","06633007","Espenau",633007,{"$f":"VLOOKUP(J377,Adressen!$F$1:$L$469,7,FALSE)","v":34314},377,null,377,"06633026","Vellmar",396]
["Fuldabrück","LK Kassel","06633008","B",null,378,"Fuldabrück","06633008","Fuldabrück",633008,{"$f":"VLOOKUP(J378,Adressen!$F$1:$L$469,7,FALSE)","v":34277},378,null,378,"06633027","Wahlsburg",397]
["Fuldatal","LK Kassel","06633009","B",null,379,"Fuldatal","06633009","Fuldatal",633009,{"$f":"VLOOKUP(J379,Adressen!$F$1:$L$469,7,FALSE)","v":34233},379,null,379,"06633028","Wolfhagen",398]
["Grebenstein","LK Kassel","06633010","B",null,380,"Grebenstein","06633010","Grebenstein",633010,{"$f":"VLOOKUP(J380,Adressen!$F$1:$L$469,7,FALSE)","v":34393},380,null,380,"06633029","Zierenberg",399]
["Habichtswald","LK Kassel","06633011","B",null,381,"Habichtswald","06633011","Habichtswald",633011,{"$f":"VLOOKUP(J381,Adressen!$F$1:$L$469,7,FALSE)","v":34317},381,null,381,"06634000","LK Schwalm-Eder",401]
["Helsa","LK Kassel","06633012","B",null,382,"Helsa","06633012","Helsa",633012,{"$f":"VLOOKUP(J382,Adressen!$F$1:$L$469,7,FALSE)","v":34298},382,null,382,"06634001","Borken (Hessen)",402]
["Hofgeismar","LK Kassel","06633013","B",null,383,"Hofgeismar","06633013","Hofgeismar",633013,{"$f":"VLOOKUP(J383,Adressen!$F$1:$L$469,7,FALSE)","v":34369},383,null,383,"06634002","Edermünde",403]
["Immenhausen","LK Kassel","06633014","B",null,384,"Immenhausen","06633014","Immenhausen",633014,{"$f":"VLOOKUP(J384,Adressen!$F$1:$L$469,7,FALSE)","v":34376},384,null,384,"06634003","Felsberg",404]
["Kaufungen","LK Kassel","06633015","B",null,385,"Kaufungen","06633015","Kaufungen",633015,{"$f":"VLOOKUP(J385,Adressen!$F$1:$L$469,7,FALSE)","v":34260},385,null,385,"06634004","Frielendorf",405]
["Liebenau","LK Kassel","06633016","B",null,386,"Liebenau","06633016","Liebenau",633016,{"$f":"VLOOKUP(J386,Adressen!$F$1:$L$469,7,FALSE)","v":34396},386,null,386,"06634005","Fritzlar",406]
["Lohfelden","LK Kassel","06633017","B",null,387,"Lohfelden","06633017","Lohfelden",633017,{"$f":"VLOOKUP(J387,Adressen!$F$1:$L$469,7,FALSE)","v":34253},387,null,387,"06634006","Gilserberg",407]
["Naumburg","LK Kassel","06633018","B",null,388,"Naumburg","06633018","Naumburg",633018,{"$f":"VLOOKUP(J388,Adressen!$F$1:$L$469,7,FALSE)","v":34311},388,null,388,"06634007","Gudensberg",408]
["Nieste","LK Kassel","06633019","B",null,389,"Nieste","06633019","Nieste",633019,{"$f":"VLOOKUP(J389,Adressen!$F$1:$L$469,7,FALSE)","v":34329},389,null,389,"06634008","Guxhagen",409]
["Niestetal","LK Kassel","06633020","B",null,390,"Niestetal","06633020","Niestetal",633020,{"$f":"VLOOKUP(J390,Adressen!$F$1:$L$469,7,FALSE)","v":34266},390,null,390,"06634009","Homberg (Efze)",410]
["Oberweser","LK Kassel","06633021","B",null,391,"Oberweser","06633021","Oberweser",633021,{"$f":"VLOOKUP(J391,Adressen!$F$1:$L$469,7,FALSE)","v":34399},391,null,391,"06634010","Jesberg",411]
["Reinhardshagen","LK Kassel","06633022","B",null,392,"Reinhardshagen","06633022","Reinhardshagen",633022,{"$f":"VLOOKUP(J392,Adressen!$F$1:$L$469,7,FALSE)","v":34359},392,null,392,"06634011","Knüllwald",412]
["Schauenburg","LK Kassel","06633023","B",null,393,"Schauenburg","06633023","Schauenburg",633023,{"$f":"VLOOKUP(J393,Adressen!$F$1:$L$469,7,FALSE)","v":34270},393,null,393,"06634012","Körle",413]
["Söhrewald","LK Kassel","06633024","B",null,394,"Söhrewald","06633024","Söhrewald",633024,{"$f":"VLOOKUP(J394,Adressen!$F$1:$L$469,7,FALSE)","v":34320},394,null,394,"06634013","Malsfeld",414]
["Trendelburg","LK Kassel","06633025","B",null,395,"Trendelburg","06633025","Trendelburg",633025,{"$f":"VLOOKUP(J395,Adressen!$F$1:$L$469,7,FALSE)","v":34388},395,null,395,"06634014","Melsungen",415]
["Vellmar","LK Kassel","06633026","B",null,396,"Vellmar","06633026","Vellmar",633026,{"$f":"VLOOKUP(J396,Adressen!$F$1:$L$469,7,FALSE)","v":34246},396,null,396,"06634015","Morschen",416]
["Wahlsburg","LK Kassel","06633027","B",null,397,"Wahlsburg","06633027","Wahlsburg",633027,{"$f":"VLOOKUP(J397,Adressen!$F$1:$L$469,7,FALSE)","v":37194},397,null,397,"06634016","Neuental",417]
["Wolfhagen","LK Kassel","06633028","B",null,398,"Wolfhagen","06633028","Wolfhagen",633028,{"$f":"VLOOKUP(J398,Adressen!$F$1:$L$469,7,FALSE)","v":34466},398,null,398,"06634017","Neukirchen",418]
["Zierenberg","LK Kassel","06633029","B",null,399,"Zierenberg","06633029","Zierenberg",633029,{"$f":"VLOOKUP(J399,Adressen!$F$1:$L$469,7,FALSE)","v":34289},399,null,399,"06634018","Niedenstein",419]
[null,null,null,"B",null,400,"Bitte auswählen!",null,"Bitte auswählen!","",null,400,null,400,"06634019","Oberaula",420]
["LK Schwalm-Eder","LK Schwalm-Eder","06634","B",null,401,"LK Schwalm-Eder","06634000","LK Schwalm-Eder",634000,{"$f":"VLOOKUP(J401,Adressen!$F$1:$L$469,7,FALSE)","v":34576},401,null,401,"06634020","Ottrau",421]
["Borken (Hessen)","LK Schwalm-Eder","06634001","B",null,402,"Borken (Hessen)","06634001","Borken (Hessen)",634001,{"$f":"VLOOKUP(J402,Adressen!$F$1:$L$469,7,FALSE)","v":34582},402,null,402,"06634021","Schrecksbach",422]
["Edermünde","LK Schwalm-Eder","06634002","B",null,403,"Edermünde","06634002","Edermünde",634002,{"$f":"VLOOKUP(J403,Adressen!$F$1:$L$469,7,FALSE)","v":34295},403,null,403,"06634022","Schwalmstadt",423]
["Felsberg","LK Schwalm-Eder","06634003","B",null,404,"Felsberg","06634003","Felsberg",634003,{"$f":"VLOOKUP(J404,Adressen!$F$1:$L$469,7,FALSE)","v":34587},404,null,404,"06634023","Schwarzenborn",424]
["Frielendorf","LK Schwalm-Eder","06634004","B",null,405,"Frielendorf","06634004","Frielendorf",634004,{"$f":"VLOOKUP(J405,Adressen!$F$1:$L$469,7,FALSE)","v":34621},405,null,405,"06634024","Spangenberg",425]
["Fritzlar","LK Schwalm-Eder","06634005","B",null,406,"Fritzlar","06634005","Fritzlar",634005,{"$f":"VLOOKUP(J406,Adressen!$F$1:$L$469,7,FALSE)","v":34560},406,null,406,"06634025","Wabern",426]
["Gilserberg","LK Schwalm-Eder","06634006","B",null,407,"Gilserberg","06634006","Gilserberg",634006,{"$f":"VLOOKUP(J407,Adressen!$F$1:$L$469,7,FALSE)","v":34630},407,null,407,"06634026","Willingshausen",427]
["Gudensberg","LK Schwalm-Eder","06634007","B",null,408,"Gudensberg","06634007","Gudensberg",634007,{"$f":"VLOOKUP(J408,Adressen!$F$1:$L$469,7,FALSE)","v":34281},408,null,408,"06634027","Bad Zwesten",428]
["Guxhagen","LK Schwalm-Eder","06634008","B",null,409,"Guxhagen","06634008","Guxhagen",634008,{"$f":"VLOOKUP(J409,Adressen!$F$1:$L$469,7,FALSE)","v":34302},409,null,409,"06635000","LK Waldeck-Frankenberg",430]
["Homberg (Efze)","LK Schwalm-Eder","06634009","B",null,410,"Homberg (Efze)","06634009","Homberg (Efze)",634009,{"$f":"VLOOKUP(J410,Adressen!$F$1:$L$469,7,FALSE)","v":34576},410,null,410,"06635001","Allendorf (Eder)",431]
["Jesberg","LK Schwalm-Eder","06634010","B",null,411,"Jesberg","06634010","Jesberg",634010,{"$f":"VLOOKUP(J411,Adressen!$F$1:$L$469,7,FALSE)","v":34632},411,null,411,"06635002","Bad Arolsen",432]
["Knüllwald","LK Schwalm-Eder","06634011","B",null,412,"Knüllwald","06634011","Knüllwald",634011,{"$f":"VLOOKUP(J412,Adressen!$F$1:$L$469,7,FALSE)","v":34593},412,null,412,"06635003","Bad Wildungen",433]
["Körle","LK Schwalm-Eder","06634012","B",null,413,"Körle","06634012","Körle",634012,{"$f":"VLOOKUP(J413,Adressen!$F$1:$L$469,7,FALSE)","v":34327},413,null,413,"06635004","Battenberg (Eder)",434]
["Malsfeld","LK Schwalm-Eder","06634013","B",null,414,"Malsfeld","06634013","Malsfeld",634013,{"$f":"VLOOKUP(J414,Adressen!$F$1:$L$469,7,FALSE)","v":34323},414,null,414,"06635005","Bromskirchen",435]
["Melsungen","LK Schwalm-Eder","06634014","B",null,415,"Melsungen","06634014","Melsungen",634014,{"$f":"VLOOKUP(J415,Adressen!$F$1:$L$469,7,FALSE)","v":34212},415,null,415,"06635006","Burgwald",436]
["Morschen","LK Schwalm-Eder","06634015","B",null,416,"Morschen","06634015","Morschen",634015,{"$f":"VLOOKUP(J416,Adressen!$F$1:$L$469,7,FALSE)","v":34326},416,null,416,"06635007","Diemelsee",437]
["Neuental","LK Schwalm-Eder","06634016","B",null,417,"Neuental","06634016","Neuental",634016,{"$f":"VLOOKUP(J417,Adressen!$F$1:$L$469,7,FALSE)","v":34599},417,null,417,"06635008","Diemelstadt",438]
["Neukirchen","LK Schwalm-Eder","06634017","B",null,418,"Neukirchen","06634017","Neukirchen",634017,{"$f":"VLOOKUP(J418,Adressen!$F$1:$L$469,7,FALSE)","v":34626},418,null,418,"06635009","Edertal",439]
["Niedenstein","LK Schwalm-Eder","06634018","B",null,419,"Niedenstein","06634018","Niedenstein",634018,{"$f":"VLOOKUP(J419,Adressen!$F$1:$L$469,7,FALSE)","v":34305},419,null,419,"06635010","Frankenau",440]
["Oberaula","LK Schwalm-Eder","06634019","B",null,420,"Oberaula","06634019","Oberaula",634019,{"$f":"VLOOKUP(J420,Adressen!$F$1:$L$469,7,FALSE)","v":36280},420,null,420,"06635011","Frankenberg (Eder)",441]
["Ottrau","LK Schwalm-Eder","06634020","B",null,421,"Ottrau","06634020","Ottrau",634020,{"$f":"VLOOKUP(J421,Adressen!$F$1:$L$469,7,FALSE)","v":34633},421,null,421,"06635012","Gemünden (Wohra)",442]
["Schrecksbach","LK Schwalm-Eder","06634021","B",null,422,"Schrecksbach","06634021","Schrecksbach",634021,{"$f":"VLOOKUP(J422,Adressen!$F$1:$L$469,7,FALSE)","v":34637},422,null,422,"06635013","Haina (Kloster)",443]
["Schwalmstadt","LK Schwalm-Eder","06634022","B",null,423,"Schwalmstadt","06634022","Schwalmstadt",634022,{"$f":"VLOOKUP(J423,Adressen!$F$1:$L$469,7,FALSE)","v":34613},423,null,423,"06635014","Hatzfeld (Eder)",444]
["Schwarzenborn","LK Schwalm-Eder","06634023","B",null,424,"Schwarzenborn","06634023","Schwarzenborn",634023,{"$f":"VLOOKUP(J424,Adressen!$F$1:$L$469,7,FALSE)","v":34639},424,null,424,"06635015","Korbach",445]
["Spangenberg","LK Schwalm-Eder","06634024","B",null,425,"Spangenberg","06634024","Spangenberg",634024,{"$f":"VLOOKUP(J425,Adressen!$F$1:$L$469,7,FALSE)","v":34286},425,null,425,"06635016","Lichtenfels",446]
["Wabern","LK Schwalm-Eder","06634025","B",null,426,"Wabern","06634025","Wabern",634025,{"$f":"VLOOKUP(J426,Adressen!$F$1:$L$469,7,FALSE)","v":34590},426,null,426,"06635017","Rosenthal",447]
["Willingshausen","LK Schwalm-Eder","06634026","B",null,427,"Willingshausen","06634026","Willingshausen",634026,{"$f":"VLOOKUP(J427,Adressen!$F$1:$L$469,7,FALSE)","v":34628},427,null,427,"06635018","Twistetal",448]
["Bad Zwesten","LK Schwalm-Eder","06634027","B",null,428,"Bad Zwesten","06634027","Bad Zwesten",634027,{"$f":"VLOOKUP(J428,Adressen!$F$1:$L$469,7,FALSE)","v":34596},428,null,428,"06635019","Vöhl",449]
[null,null,null,"B",null,429,"Bitte auswählen!",null,"Bitte auswählen!","",null,429,null,429,"06635020","Volkmarsen",450]
["LK Waldeck-Frankenberg","LK Waldeck-Frankenberg","06635","B",null,430,"LK Waldeck-Frankenberg","06635000","LK Waldeck-Frankenberg",635000,{"$f":"VLOOKUP(J430,Adressen!$F$1:$L$469,7,FALSE)","v":34497},430,null,430,"06635021","Waldeck",451]
["Allendorf (Eder)","LK Waldeck-Frankenberg","06635001","B",null,431,"Allendorf (Eder)","06635001","Allendorf (Eder)",635001,{"$f":"VLOOKUP(J431,Adressen!$F$1:$L$469,7,FALSE)","v":35108},431,null,431,"06635022","Willingen (Upland)",452]
["Bad Arolsen","LK Waldeck-Frankenberg","06635002","B",null,432,"Bad Arolsen","06635002","Bad Arolsen",635002,{"$f":"VLOOKUP(J432,Adressen!$F$1:$L$469,7,FALSE)","v":34454},432,null,432,"06636000","LK Werra-Meißner",454]
["Bad Wildungen","LK Waldeck-Frankenberg","06635003","B",null,433,"Bad Wildungen","06635003","Bad Wildungen",635003,{"$f":"VLOOKUP(J433,Adressen!$F$1:$L$469,7,FALSE)","v":34537},433,null,433,"06636001","Bad Sooden-Allendorf",455]
["Battenberg (Eder)","LK Waldeck-Frankenberg","06635004","B",null,434,"Battenberg (Eder)","06635004","Battenberg (Eder)",635004,{"$f":"VLOOKUP(J434,Adressen!$F$1:$L$469,7,FALSE)","v":35088},434,null,434,"06636002","Berkatal",456]
["Bromskirchen","LK Waldeck-Frankenberg","06635005","B",null,435,"Bromskirchen","06635005","Bromskirchen",635005,{"$f":"VLOOKUP(J435,Adressen!$F$1:$L$469,7,FALSE)","v":59969},435,null,435,"06636003","Eschwege",457]
["Burgwald","LK Waldeck-Frankenberg","06635006","B",null,436,"Burgwald","06635006","Burgwald",635006,{"$f":"VLOOKUP(J436,Adressen!$F$1:$L$469,7,FALSE)","v":35099},436,null,436,"06636004","Großalmerode",458]
["Diemelsee","LK Waldeck-Frankenberg","06635007","B",null,437,"Diemelsee","06635007","Diemelsee",635007,{"$f":"VLOOKUP(J437,Adressen!$F$1:$L$469,7,FALSE)","v":34519},437,null,437,"06636005","Herleshausen",459]
["Diemelstadt","LK Waldeck-Frankenberg","06635008","B",null,438,"Diemelstadt","06635008","Diemelstadt",635008,{"$f":"VLOOKUP(J438,Adressen!$F$1:$L$469,7,FALSE)","v":34474},438,null,438,"06636006","Hessisch Lichtenau",460]
["Edertal","LK Waldeck-Frankenberg","06635009","B",null,439,"Edertal","06635009","Edertal",635009,{"$f":"VLOOKUP(J439,Adressen!$F$1:$L$469,7,FALSE)","v":34549},439,null,439,"06636007","Meinhard",461]
["Frankenau","LK Waldeck-Frankenberg","06635010","B",null,440,"Frankenau","06635010","Frankenau",635010,{"$f":"VLOOKUP(J440,Adressen!$F$1:$L$469,7,FALSE)","v":35110},440,null,440,"06636008","Meißner",462]
["Frankenberg (Eder)","LK Waldeck-Frankenberg","06635011","B",null,441,"Frankenberg (Eder)","06635011","Frankenberg (Eder)",635011,{"$f":"VLOOKUP(J441,Adressen!$F$1:$L$469,7,FALSE)","v":35066},441,null,441,"06636009","Neu-Eichenberg",463]
["Gemünden (Wohra)","LK Waldeck-Frankenberg","06635012","B",null,442,"Gemünden (Wohra)","06635012","Gemünden (Wohra)",635012,{"$f":"VLOOKUP(J442,Adressen!$F$1:$L$469,7,FALSE)","v":35285},442,null,442,"06636010","Ringgau",464]
["Haina (Kloster)","LK Waldeck-Frankenberg","06635013","B",null,443,"Haina (Kloster)","06635013","Haina (Kloster)",635013,{"$f":"VLOOKUP(J443,Adressen!$F$1:$L$469,7,FALSE)","v":35114},443,null,443,"06636011","Sontra",465]
["Hatzfeld (Eder)","LK Waldeck-Frankenberg","06635014","B",null,444,"Hatzfeld (Eder)","06635014","Hatzfeld (Eder)",635014,{"$f":"VLOOKUP(J444,Adressen!$F$1:$L$469,7,FALSE)","v":35116},444,null,444,"06636012","Waldkappel",466]
["Korbach","LK Waldeck-Frankenberg","06635015","B",null,445,"Korbach","06635015","Korbach",635015,{"$f":"VLOOKUP(J445,Adressen!$F$1:$L$469,7,FALSE)","v":34497},445,null,445,"06636013","Wanfried",467]
["Lichtenfels","LK Waldeck-Frankenberg","06635016","B",null,446,"Lichtenfels","06635016","Lichtenfels",635016,{"$f":"VLOOKUP(J446,Adressen!$F$1:$L$469,7,FALSE)","v":35104},446,null,446,"06636014","Wehretal",468]
["Rosenthal","LK Waldeck-Frankenberg","06635017","B",null,447,"Rosenthal","06635017","Rosenthal",635017,{"$f":"VLOOKUP(J447,Adressen!$F$1:$L$469,7,FALSE)","v":35119},447,null,447,"06636015","Weißenborn",469]
["Twistetal","LK Waldeck-Frankenberg","06635018","B",null,448,"Twistetal","06635018","Twistetal",635018,{"$f":"VLOOKUP(J448,Adressen!$F$1:$L$469,7,FALSE)","v":34477},448,null,448,"06636016","Witzenhausen",470]
["Vöhl","LK Waldeck-Frankenberg","06635019","B",null,449,"Vöhl","06635019","Vöhl",635019,{"$f":"VLOOKUP(J449,Adressen!$F$1:$L$469,7,FALSE)","v":34516},449,null,449,null,"Bitte auswählen!",2]
["Volkmarsen","LK Waldeck-Frankenberg","06635020","B",null,450,"Volkmarsen","06635020","Volkmarsen",635020,{"$f":"VLOOKUP(J450,Adressen!$F$1:$L$469,7,FALSE)","v":34471},450,null,450,null,"Bitte auswählen!",7]
["Waldeck","LK Waldeck-Frankenberg","06635021","B",null,451,"Waldeck","06635021","Waldeck",635021,{"$f":"VLOOKUP(J451,Adressen!$F$1:$L$469,7,FALSE)","v":34513},451,null,451,null,"Bitte auswählen!",31]
["Willingen (Upland)","LK Waldeck-Frankenberg","06635022","B",null,452,"Willingen (Upland)","06635022","Willingen (Upland)",635022,{"$f":"VLOOKUP(J452,Adressen!$F$1:$L$469,7,FALSE)","v":34508},452,null,452,null,"Bitte auswählen!",56]
[null,null,null,"B",null,453,"Bitte auswählen!",null,"Bitte auswählen!","",null,453,null,453,null,"Bitte auswählen!",72]
["LK Werra-Meißner","LK Werra-Meißner","06636","B",null,454,"LK Werra-Meißner","06636000","LK Werra-Meißner",636000,{"$f":"VLOOKUP(J454,Adressen!$F$1:$L$469,7,FALSE)","v":37269},454,null,454,null,"Bitte auswählen!",87]
["Bad Sooden-Allendorf","LK Werra-Meißner","06636001","B",null,455,"Bad Sooden-Allendorf","06636001","Bad Sooden-Allendorf",636001,{"$f":"VLOOKUP(J455,Adressen!$F$1:$L$469,7,FALSE)","v":37242},455,null,455,null,"Bitte auswählen!",118]
["Berkatal","LK Werra-Meißner","06636002","B",null,456,"Berkatal","06636002","Berkatal",636002,{"$f":"VLOOKUP(J456,Adressen!$F$1:$L$469,7,FALSE)","v":37297},456,null,456,null,"Bitte auswählen!",132]
["Eschwege","LK Werra-Meißner","06636003","B",null,457,"Eschwege","06636003","Eschwege",636003,{"$f":"VLOOKUP(J457,Adressen!$F$1:$L$469,7,FALSE)","v":37269},457,null,457,null,"Bitte auswählen!",149]
["Großalmerode","LK Werra-Meißner","06636004","B",null,458,"Großalmerode","06636004","Großalmerode",636004,{"$f":"VLOOKUP(J458,Adressen!$F$1:$L$469,7,FALSE)","v":37247},458,null,458,null,"Bitte auswählen!",164]
["Herleshausen","LK Werra-Meißner","06636005","B",null,459,"Herleshausen","06636005","Herleshausen",636005,{"$f":"VLOOKUP(J459,Adressen!$F$1:$L$469,7,FALSE)","v":37293},459,null,459,null,"Bitte auswählen!",183]
["Hessisch Lichtenau","LK Werra-Meißner","06636006","B",null,460,"Hessisch Lichtenau","06636006","Hessisch Lichtenau",636006,{"$f":"VLOOKUP(J460,Adressen!$F$1:$L$469,7,FALSE)","v":37235},460,null,460,null,"Bitte auswählen!",210]
["Meinhard","LK Werra-Meißner","06636007","B",null,461,"Meinhard","06636007","Meinhard",636007,{"$f":"VLOOKUP(J461,Adressen!$F$1:$L$469,7,FALSE)","v":37276},461,null,461,null,"Bitte auswählen!",230]
["Meißner","LK Werra-Meißner","06636008","B",null,462,"Meißner","06636008","Meißner",636008,{"$f":"VLOOKUP(J462,Adressen!$F$1:$L$469,7,FALSE)","v":37290},462,null,462,null,"Bitte auswählen!",255]
["Neu-Eichenberg","LK Werra-Meißner","06636009","B",null,463,"Neu-Eichenberg","06636009","Neu-Eichenberg",636009,{"$f":"VLOOKUP(J463,Adressen!$F$1:$L$469,7,FALSE)","v":37249},463,null,463,null,"Bitte auswählen!",276]
["Ringgau","LK Werra-Meißner","06636010","B",null,464,"Ringgau","06636010","Ringgau",636010,{"$f":"VLOOKUP(J464,Adressen!$F$1:$L$469,7,FALSE)","v":37296},464,null,464,null,"Bitte auswählen!",300]
["Sontra","LK Werra-Meißner","06636011","B",null,465,"Sontra","06636011","Sontra",636011,{"$f":"VLOOKUP(J465,Adressen!$F$1:$L$469,7,FALSE)","v":36205},465,null,465,null,"Bitte auswählen!",322]
["Waldkappel","LK Werra-Meißner","06636012","B",null,466,"Waldkappel","06636012","Waldkappel",636012,{"$f":"VLOOKUP(J466,Adressen!$F$1:$L$469,7,FALSE)","v":37284},466,null,466,null,"Bitte auswählen!",347]
["Wanfried","LK Werra-Meißner","06636013","B",null,467,"Wanfried","06636013","Wanfried",636013,{"$f":"VLOOKUP(J467,Adressen!$F$1:$L$469,7,FALSE)","v":37281},467,null,467,null,"Bitte auswählen!",369]
["Wehretal","LK Werra-Meißner","06636014","B",null,468,"Wehretal","06636014","Wehretal",636014,{"$f":"VLOOKUP(J468,Adressen!$F$1:$L$469,7,FALSE)","v":37287},468,null,468,null,"Bitte auswählen!",400]
["Weißenborn","LK Werra-Meißner","06636015","B",null,469,"Weißenborn","06636015","Weißenborn",636015,{"$f":"VLOOKUP(J469,Adressen!$F$1:$L$469,7,FALSE)","v":37299},469,null,469,null,"Bitte auswählen!",429]
["Witzenhausen","LK Werra-Meißner","06636016","B",null,470,"Witzenhausen","06636016","Witzenhausen",636016,{"$f":"VLOOKUP(J470,Adressen!$F$1:$L$469,7,FALSE)","v":37213},470,null,470,null,"Bitte auswählen!",453]
[1,2,3,4,5,6,7,8,7,9,10,6]

{"sheet":"Werteliste ID_FOERDB","index":5,"n_rows":20,"n_cols":15,"rows_kept":20,"cut":false,"hidden":true,"merged":[]}
["Werteliste Art der Maßnahme"]
[]
["Bitte auswählen!",1,"Keine Auswahl getroffen!","-"]
["1. a)  Krankenhäuser (Förderung in Hessen grds. über das Landesprogramm) ",2,"1. a)  Krankenhäuser ","-","1a"]
["1. b)  Lärmbekämpfung, insbesondere bei Straßen, ohne Schutz vor verhaltensbezogenem Lärm",3,"1. b)  Lärmbekämpfung, insbesondere bei Straßen, ohne Schutz vor verhaltensbezogenem Lärm","Die Umsetzung einer \"normalen Straßensanierung\" (ohne eine nachweisbare Lärmreduzierung über den Förderbereich nach § 3 S.1 Nr.1b KInvFG) ist nicht möglich.","1b"]
["1. c)  Städtebau (ohne Abwasser) einschließlich altersgerechter Umbau, Barriereabbau (auch im öffentlichen Personennahverkehr), Brachflächenrevitalisierung",4,"1. c)  Städtebau (ohne Abwasser) einschließlich altersgerechter Umbau, Barriereabbau , Brachflächenrevitalisierung","Der Barriereabbau wird auch im öffentlichen Personennahverkehr gefördert.\nRechtsgrundlage für die Förderung des Bundes ist das BauGB. ","1c"]
["1. d)  Informationstechnologie, beschränkt auf finanzschwache Kommunen in ländlichen Gebieten, zur Erreichung des 50 Mbit-Ausbauziels",5,"1. d)  Informationstechnologie, beschränkt auf finanzschwache Kommunen in ländlichen Gebieten, zur Erreichung des 50 Mbit-Ausbauziels","Die \"ländlichen Gebiete\" bestimmen sich nach den Zuordnungen des Landesentwicklungsplans.","1d"]
["1. e)  Energetische Sanierung sonstiger Infrastrukturinvestitionen",6,"1. e)  Energetische Sanierung sonstiger Infrastrukturinvestitionen","-","1e"]
["1. f)  Luftreinhaltung",7,"1. f)  Luftreinhaltung","-","1f"]
["2. a)  Einrichtungen der frühkindlichen Infrastruktur, einschließlich des Anschlusses dieser Infrastruktur an ein vorhandenes Netz, aus dem Wärme aus erneuerbaren Energieträgern bezogen wird",8,"2. a)  Einrichtungen der frühkindlichen Infrastruktur","Einschließlich des Anschlusses dieser Infrastruktur an ein vorhandenes Netz, aus dem Wärme aus erneuerbaren Energieträgern bezogen wird.\n\"frühkindlich\": betrifft Kinder bis zur Einschulung","2a"]
["2. b)  Energetische Sanierung von Einrichtungen der Schulinfrastruktur",9,"2. b)  Energetische Sanierung von Einrichtungen der Schulinfrastruktur","Es können ausschließlich Maßnahmen zur energetischen Sanierung gefördert werden. Eine Generalsanierung eines Schulgebäudes ist nicht möglich.","2b"]
["2. c)  Energetische Sanierung kommunaler oder gemeinnütziger Einrichtungen der Weiterbildung",10,"2. c)  Energetische Sanierung kommunaler oder gemeinnütziger Einrichtungen der Weiterbildung","-","2c"]
["2. d)  Modernisierung von überbetrieblichen Berufsbildungsstätten",11,"2. d)  Modernisierung von überbetrieblichen Berufsbildungsstätten","Die Modernisierung umfasst eine Erhöhung des Standards der Berufsbildungsstätte, genauer: des Gebäudes.","2d"]
[]
[]
[]
[]
[]
[]
[1,2,3,4,5,6,7,8,9,10,11,12,13,14,15]

{"sheet":"Werteliste Gemeindeschlüssel","index":6,"n_rows":471,"n_cols":5,"rows_kept":471,"cut":false,"hidden":true,"merged":[]}
["Werteliste Gemeindeschlüssel"]
[]
["bitte auswählen",1,"Gemeindeschlüssel","Kommune","Landkreis"]
[{"$f":"CONCATENATE(C4,\"           \",D4)","v":"06411           Darmstadt"},2,"06411","Darmstadt",""]
[{"$f":"CONCATENATE(C5,\"           \",D5)","v":"06412           Frankfurt am Main"},3,"06412","Frankfurt am Main",""]
[{"$f":"CONCATENATE(C6,\"           \",D6)","v":"06413           Offenbach am Main"},4,"06413","Offenbach am Main",""]
[{"$f":"CONCATENATE(C7,\"           \",D7)","v":"06414           Wiesbaden"},5,"06414","Wiesbaden",""]
[]
[{"$f":"CONCATENATE(C9,\"           \",D9)","v":"06431           LK Bergstraße"},6,"06431","LK Bergstraße","LK Bergstraße"]
[{"$f":"CONCATENATE(C10,\"     \",D10)","v":"06431001     Abtsteinach"},7,"06431001","Abtsteinach","LK Bergstraße"]
["06431002     Bensheim",8,"06431002","Bensheim","LK Bergstraße"]
["06431003     Biblis",9,"06431003","Biblis","LK Bergstraße"]
["06431004     Birkenau",10,"06431004","Birkenau","LK Bergstraße"]
["06431005     Bürstadt",11,"06431005","Bürstadt","LK Bergstraße"]
["06431006     Einhausen",12,"06431006","Einhausen","LK Bergstraße"]
["06431007     Fürth",13,"06431007","Fürth","LK Bergstraße"]
["06431008     Gorxheimertal",14,"06431008","Gorxheimertal","LK Bergstraße"]
["06431009     Grasellenbach",15,"06431009","Grasellenbach","LK Bergstraße"]
["06431010     Groß-Rohrheim",16,"06431010","Groß-Rohrheim","LK Bergstraße"]
["06431011     Heppenheim (Bergstraße)",17,"06431011","Heppenheim (Bergstraße)","LK Bergstraße"]
["06431012     Hirschhorn (Neckar)",18,"06431012","Hirschhorn (Neckar)","LK Bergstraße"]
["06431013     Lampertheim",19,"06431013","Lampertheim","LK Bergstraße"]
["06431014     Lautertal (Odenwald)",20,"06431014","Lautertal (Odenwald)","LK Bergstraße"]
["06431015     Lindenfels",21,"06431015","Lindenfels","LK Bergstraße"]
["06431016     Lorsch",22,"06431016","Lorsch","LK Bergstraße"]
["06431017     Mörlenbach",23,"06431017","Mörlenbach","LK Bergstraße"]
["06431018     Neckarsteinach",24,"06431018","Neckarsteinach","LK Bergstraße"]
["06431019     Rimbach",25,"06431019","Rimbach","LK Bergstraße"]
["06431020     Viernheim",26,"06431020","Viernheim","LK Bergstraße"]
["06431021     Wald-Michelbach",27,"06431021","Wald-Michelbach","LK Bergstraße"]
["06431022     Zwingenberg",28,"06431022","Zwingenberg","LK Bergstraße"]
[]
[{"$f":"CONCATENATE(C33,\"           \",D33)","v":"06432           LK Darmstadt-Dieburg"},29,"06432","LK Darmstadt-Dieburg","LK Darmstadt-Dieburg"]
[{"$f":"CONCATENATE(C34,\"     \",D34)","v":"06432001     Alsbach-Hähnlein"},30,"06432001","Alsbach-Hähnlein","LK Darmstadt-Dieburg"]
["06432002     Babenhausen",31,"06432002","Babenhausen","LK Darmstadt-Dieburg"]
["06432003     Bickenbach",32,"06432003","Bickenbach","LK Darmstadt-Dieburg"]
["06432004     Dieburg       ",33,"06432004","Dieburg       ","LK Darmstadt-Dieburg"]
["06432005     Eppertshausen",34,"06432005","Eppertshausen","LK Darmstadt-Dieburg"]
["06432006     Erzhausen",35,"06432006","Erzhausen","LK Darmstadt-Dieburg"]
["06432007     Fischbachtal",36,"06432007","Fischbachtal","LK Darmstadt-Dieburg"]
["06432008     Griesheim",37,"06432008","Griesheim","LK Darmstadt-Dieburg"]
["06432009     Groß-Bieberau  ",38,"06432009","Groß-Bieberau  ","LK Darmstadt-Dieburg"]
["06432010     Groß-Umstadt",39,"06432010","Groß-Umstadt","LK Darmstadt-Dieburg"]
["06432011     Groß-Zimmern",40,"06432011","Groß-Zimmern","LK Darmstadt-Dieburg"]
["06432012     Messel         ",41,"06432012","Messel         ","LK Darmstadt-Dieburg"]
["06432013     Modautal",42,"06432013","Modautal","LK Darmstadt-Dieburg"]
["06432014     Mühltal",43,"06432014","Mühltal","LK Darmstadt-Dieburg"]
["06432015     Münster",44,"06432015","Münster","LK Darmstadt-Dieburg"]
["06432016     Ober-Ramstadt",45,"06432016","Ober-Ramstadt","LK Darmstadt-Dieburg"]
["06432017     Otzberg",46,"06432017","Otzberg","LK Darmstadt-Dieburg"]
["06432018     Pfungstadt",47,"06432018","Pfungstadt","LK Darmstadt-Dieburg"]
["06432019     Reinheim",48,"06432019","Reinheim","LK Darmstadt-Dieburg"]
["06432020     Roßdorf",49,"06432020","Roßdorf","LK Darmstadt-Dieburg"]
["06432021     Schaafheim",50,"06432021","Schaafheim","LK Darmstadt-Dieburg"]
["06432022     Seeheim-Jugenheim",51,"06432022","Seeheim-Jugenheim","LK Darmstadt-Dieburg"]
["06432023     Weiterstadt",52,"06432023","Weiterstadt","LK Darmstadt-Dieburg"]
[]
[{"$f":"CONCATENATE(C58,\"           \",D58)","v":"06433           LK Groß-Gerau"},53,"06433","LK Groß-Gerau","LK Groß-Gerau"]
[{"$f":"CONCATENATE(C59,\"     \",D59)","v":"06433001     Biebesheim am Rhein"},54,"06433001","Biebesheim am Rhein","LK Groß-Gerau"]
["06433002     Bischofsheim",55,"06433002","Bischofsheim","LK Groß-Gerau"]
["06433003     Büttelborn",56,"06433003","Büttelborn","LK Groß-Gerau"]
["06433004     Gernsheim",57,"06433004","Gernsheim","LK Groß-Gerau"]
["06433005     Ginsheim-Gustavsburg",58,"06433005","Ginsheim-Gustavsburg","LK Groß-Gerau"]
["06433006     Groß-Gerau     ",59,"06433006","Groß-Gerau     ","LK Groß-Gerau"]
["06433007     Kelsterbach    ",60,"06433007","Kelsterbach    ","LK Groß-Gerau"]
["06433008     Mörfelden-Walldorf",61,"06433008","Mörfelden-Walldorf","LK Groß-Gerau"]
["06433009     Nauheim",62,"06433009","Nauheim","LK Groß-Gerau"]
["06433010     Raunheim",63,"06433010","Raunheim","LK Groß-Gerau"]
["06433011     Riedstadt",64,"06433011","Riedstadt","LK Groß-Gerau"]
["06433012     Rüsselsheim",65,"06433012","Rüsselsheim","LK Groß-Gerau"]
["06433013     Stockstadt",66,"06433013","Stockstadt","LK Groß-Gerau"]
["06433014     Trebur         ",67,"06433014","Trebur         ","LK Groß-Gerau"]
[]
[{"$f":"CONCATENATE(C74,\"           \",D74)","v":"06434           LK Hochtaunus"},68,"06434","LK Hochtaunus","LK Hochtaunus"]
[{"$f":"CONCATENATE(C75,\"     \",D75)","v":"06434001     Bad Homburg v.d.H."},69,"06434001","Bad Homburg v.d.H.","LK Hochtaunus"]
["06434002     Friedrichsdorf",70,"06434002","Friedrichsdorf","LK Hochtaunus"]
["06434003     Glashütten",71,"06434003","Glashütten","LK Hochtaunus"]
["06434004     Grävenwiesbach",72,"06434004","Grävenwiesbach","LK Hochtaunus"]
["06434005     Königstein im Taunus",73,"06434005","Königstein im Taunus","LK Hochtaunus"]
["06434006     Kronberg       ",74,"06434006","Kronberg       ","LK Hochtaunus"]
["06434007     Neu-Anspach",75,"06434007","Neu-Anspach","LK Hochtaunus"]
["06434008     Oberursel (Taunus)",76,"06434008","Oberursel (Taunus)","LK Hochtaunus"]
["06434009     Schmitten",77,"06434009","Schmitten","LK Hochtaunus"]
["06434010     Steinbach (Taunus)",78,"06434010","Steinbach (Taunus)","LK Hochtaunus"]
["06434011     Usingen",79,"06434011","Usingen","LK Hochtaunus"]
["06434012     Wehrheim",80,"06434012","Wehrheim","LK Hochtaunus"]
["06434013     Weilrod",81,"06434013","Weilrod","LK Hochtaunus"]
[]
[{"$f":"CONCATENATE(C89,\"           \",D89)","v":"06435           LK Main-Kinzig"},82,"06435","LK Main-Kinzig","LK Main-Kinzig"]
[{"$f":"CONCATENATE(C90,\"     \",D90)","v":"06435001     Bad Orb"},83,"06435001","Bad Orb","LK Main-Kinzig"]
["06435002     Bad Soden-Salmünster",84,"06435002","Bad Soden-Salmünster","LK Main-Kinzig"]
["06435003     Biebergemünd",85,"06435003","Biebergemünd","LK Main-Kinzig"]
["06435004     Birstein",86,"06435004","Birstein","LK Main-Kinzig"]
["06435005     Brachttal",87,"06435005","Brachttal","LK Main-Kinzig"]
["06435006     Bruchköbel",88,"06435006","Bruchköbel","LK Main-Kinzig"]
["06435007     Erlensee",89,"06435007","Erlensee","LK Main-Kinzig"]
["06435008     Flörsbachtal",90,"06435008","Flörsbachtal","LK Main-Kinzig"]
["06435009     Freigericht",91,"06435009","Freigericht","LK Main-Kinzig"]
["06435010     Gelnhausen",92,"06435010","Gelnhausen","LK Main-Kinzig"]
["06435011     Großkrotzenburg",93,"06435011","Großkrotzenburg","LK Main-Kinzig"]
["06435012     Gründau",94,"06435012","Gründau","LK Main-Kinzig"]
["06435013     Hammersbach",95,"06435013","Hammersbach","LK Main-Kinzig"]
["06435014     Hanau",96,"06435014","Hanau","LK Main-Kinzig"]
["06435015     Hasselroth",97,"06435015","Hasselroth","LK Main-Kinzig"]
["06435016     Jossgrund",98,"06435016","Jossgrund","LK Main-Kinzig"]
["06435017     Langenselbold",99,"06435017","Langenselbold","LK Main-Kinzig"]
["06435018     Linsengericht",100,"06435018","Linsengericht","LK Main-Kinzig"]
["06435019     Maintal",101,"06435019","Maintal","LK Main-Kinzig"]
["06435020     Neuberg",102,"06435020","Neuberg","LK Main-Kinzig"]
["06435021     Nidderau",103,"06435021","Nidderau","LK Main-Kinzig"]
["06435022     Niederdorfelden",104,"06435022","Niederdorfelden","LK Main-Kinzig"]
["06435023     Rodenbach",105,"06435023","Rodenbach","LK Main-Kinzig"]
["06435024     Ronneburg",106,"06435024","Ronneburg","LK Main-Kinzig"]
["06435025     Schlüchtern",107,"06435025","Schlüchtern","LK Main-Kinzig"]
["06435026     Schöneck",108,"06435026","Schöneck","LK Main-Kinzig"]
["06435027     Sinntal",109,"06435027","Sinntal","LK Main-Kinzig"]
["06435028     Steinau an der Straße",110,"06435028","Steinau an der Straße","LK Main-Kinzig"]
["06435029     Wächtersbach",111,"06435029","Wächtersbach","LK Main-Kinzig"]
[]
[{"$f":"CONCATENATE(C120,\"           \",D120)","v":"06436           LK Main-Taunus"},112,"06436","LK Main-Taunus","LK Main-Taunus"]
[{"$f":"CONCATENATE(C121,\"     \",D121)","v":"06436001     Bad Soden am Taunus"},113,"06436001","Bad Soden am Taunus","LK Main-Taunus"]
["06436002     Eppstein",114,"06436002","Eppstein","LK Main-Taunus"]
["06436003     Eschborn       ",115,"06436003","Eschborn       ","LK Main-Taunus"]
["06436004     Flörsheim am Main",116,"06436004","Flörsheim am Main","LK Main-Taunus"]
["06436005     Hattersheim am Main",117,"06436005","Hattersheim am Main","LK Main-Taunus"]
["06436006     Hochheim am Main",118,"06436006","Hochheim am Main","LK Main-Taunus"]
["06436007     Hofheim am Taunus",119,"06436007","Hofheim am Taunus","LK Main-Taunus"]
["06436008     Kelkheim (Taunus)",120,"06436008","Kelkheim (Taunus)","LK Main-Taunus"]
["06436009     Kriftel",121,"06436009","Kriftel","LK Main-Taunus"]
["06436010     Liederbach am Taunus",122,"06436010","Liederbach am Taunus","LK Main-Taunus"]
["06436011     Schwalbach     ",123,"06436011","Schwalbach     ","LK Main-Taunus"]
["06436012     Sulzbach       ",124,"06436012","Sulzbach       ","LK Main-Taunus"]
[]
[{"$f":"CONCATENATE(C134,\"           \",D134)","v":"06437           LK Odenwald"},125,"06437","LK Odenwald","LK Odenwald"]
[{"$f":"CONCATENATE(C135,\"     \",D135)","v":"06437001     Bad König"},126,"06437001","Bad König","LK Odenwald"]
["06437002     Beerfelden     ",127,"06437002","Beerfelden     ","LK Odenwald"]
["06437003     Brensbach",128,"06437003","Brensbach","LK Odenwald"]
["06437004     Breuberg",129,"06437004","Breuberg","LK Odenwald"]
["06437005     Brombachtal",130,"06437005","Brombachtal","LK Odenwald"]
["06437006     Erbach",131,"06437006","Erbach","LK Odenwald"]
["06437007     Fränkisch-Crumbach",132,"06437007","Fränkisch-Crumbach","LK Odenwald"]
["06437008     Hesseneck",133,"06437008","Hesseneck","LK Odenwald"]
["06437009     Höchst i.Odw.",134,"06437009","Höchst i.Odw.","LK Odenwald"]
["06437010     Lützelbach",135,"06437010","Lützelbach","LK Odenwald"]
["06437011     Michelstadt",136,"06437011","Michelstadt","LK Odenwald"]
["06437012     Mossautal",137,"06437012","Mossautal","LK Odenwald"]
["06437013     Reichelsheim (Odenwald)",138,"06437013","Reichelsheim (Odenwald)","LK Odenwald"]
["06437014     Rothenberg",139,"06437014","Rothenberg","LK Odenwald"]
["06437015     Sensbachtal",140,"06437015","Sensbachtal","LK Odenwald"]
[]
[{"$f":"CONCATENATE(C151,\"           \",D151)","v":"06438           LK Offenbach"},141,"06438","LK Offenbach","LK Offenbach"]
[{"$f":"CONCATENATE(C152,\"     \",D152)","v":"06438001     Dietzenbach"},142,"06438001","Dietzenbach","LK Offenbach"]
["06438002     Dreieich       ",143,"06438002","Dreieich       ","LK Offenbach"]
["06438003     Egelsbach      ",144,"06438003","Egelsbach      ","LK Offenbach"]
["06438004     Hainburg",145,"06438004","Hainburg","LK Offenbach"]
["06438005     Heusenstamm    ",146,"06438005","Heusenstamm    ","LK Offenbach"]
["06438006     Langen",147,"06438006","Langen","LK Offenbach"]
["06438007     Mainhausen",148,"06438007","Mainhausen","LK Offenbach"]
["06438008     Mühlheim am Main",149,"06438008","Mühlheim am Main","LK Offenbach"]
["06438009     Neu-Isenburg   ",150,"06438009","Neu-Isenburg   ","LK Offenbach"]
["06438010     Obertshausen",151,"06438010","Obertshausen","LK Offenbach"]
["06438011     Rodgau",152,"06438011","Rodgau","LK Offenbach"]
["06438012     Rödermark",153,"06438012","Rödermark","LK Offenbach"]
["06438013     Seligenstadt",154,"06438013","Seligenstadt","LK Offenbach"]
[]
[{"$f":"CONCATENATE(C166,\"           \",D166)","v":"06439           LK Rheingau-Taunus"},155,"06439","LK Rheingau-Taunus","LK Rheingau-Taunus"]
[{"$f":"CONCATENATE(C167,\"     \",D167)","v":"06439001     Aarbergen"},156,"06439001","Aarbergen","LK Rheingau-Taunus"]
["06439002     Bad Schwalbach",157,"06439002","Bad Schwalbach","LK Rheingau-Taunus"]
["06439003     Eltville am Rhein",158,"06439003","Eltville am Rhein","LK Rheingau-Taunus"]
["06439004     Geisenheim",159,"06439004","Geisenheim","LK Rheingau-Taunus"]
["06439005     Heidenrod",160,"06439005","Heidenrod","LK Rheingau-Taunus"]
["06439006     Hohenstein",161,"06439006","Hohenstein","LK Rheingau-Taunus"]
["06439007     Hünstetten",162,"06439007","Hünstetten","LK Rheingau-Taunus"]
["06439008     Idstein",163,"06439008","Idstein","LK Rheingau-Taunus"]
["06439009     Kiedrich",164,"06439009","Kiedrich","LK Rheingau-Taunus"]
["06439010     Lorch",165,"06439010","Lorch","LK Rheingau-Taunus"]
["06439011     Niedernhausen",166,"06439011","Niedernhausen","LK Rheingau-Taunus"]
["06439012     Oestrich-Winkel",167,"06439012","Oestrich-Winkel","LK Rheingau-Taunus"]
["06439013     Rüdesheim am Rhein",168,"06439013","Rüdesheim am Rhein","LK Rheingau-Taunus"]
["06439014     Schlangenbad",169,"06439014","Schlangenbad","LK Rheingau-Taunus"]
["06439015     Taunusstein",170,"06439015","Taunusstein","LK Rheingau-Taunus"]
["06439016     Waldems",171,"06439016","Waldems","LK Rheingau-Taunus"]
["06439017     Walluf",172,"06439017","Walluf","LK Rheingau-Taunus"]
[]
[{"$f":"CONCATENATE(C185,\"           \",D185)","v":"06440           LK Wetterau"},173,"06440","LK Wetterau","LK Wetterau"]
[{"$f":"CONCATENATE(C186,\"     \",D186)","v":"06440001     Altenstadt"},174,"06440001","Altenstadt","LK Wetterau"]
["06440002     Bad Nauheim",175,"06440002","Bad Nauheim","LK Wetterau"]
["06440003     Bad Vilbel     ",176,"06440003","Bad Vilbel     ","LK Wetterau"]
["06440004     Büdingen",177,"06440004","Büdingen","LK Wetterau"]
["06440005     Butzbach",178,"06440005","Butzbach","LK Wetterau"]
["06440006     Echzell",179,"06440006","Echzell","LK Wetterau"]
["06440007     Florstadt",180,"06440007","Florstadt","LK Wetterau"]
["06440008     Friedberg",181,"06440008","Friedberg","LK Wetterau"]
["06440009     Gedern",182,"06440009","Gedern","LK Wetterau"]
["06440010     Glauburg",183,"06440010","Glauburg","LK Wetterau"]
["06440011     Hirzenhain     ",184,"06440011","Hirzenhain     ","LK Wetterau"]
["06440012     Karben",185,"06440012","Karben","LK Wetterau"]
["06440013     Kefenrod",186,"06440013","Kefenrod","LK Wetterau"]
["06440014     Limeshain",187,"06440014","Limeshain","LK Wetterau"]
["06440015     Münzenberg",188,"06440015","Münzenberg","LK Wetterau"]
["06440016     Nidda",189,"06440016","Nidda","LK Wetterau"]
["06440017     Niddatal",190,"06440017","Niddatal","LK Wetterau"]
["06440018     Ober-Mörlen",191,"06440018","Ober-Mörlen","LK Wetterau"]
["06440019     Ortenberg",192,"06440019","Ortenberg","LK Wetterau"]
["06440020     Ranstadt",193,"06440020","Ranstadt","LK Wetterau"]
["06440021     Reichelsheim (Wetterau)",194,"06440021","Reichelsheim (Wetterau)","LK Wetterau"]
["06440022     Rockenberg",195,"06440022","Rockenberg","LK Wetterau"]
["06440023     Rosbach v. d. Höhe",196,"06440023","Rosbach v. d. Höhe","LK Wetterau"]
["06440024     Wölfersheim",197,"06440024","Wölfersheim","LK Wetterau"]
["06440025     Wöllstadt",198,"06440025","Wöllstadt","LK Wetterau"]
[]
[{"$f":"CONCATENATE(C212,\"            \",D212)","v":"06531            LK Gießen"},199,"06531","LK Gießen","LK Gießen"]
[{"$f":"CONCATENATE(C213,\"     \",D213)","v":"06531001     Allendorf (Lumda)"},200,"06531001","Allendorf (Lumda)","LK Gießen"]
["06531002     Biebertal",201,"06531002","Biebertal","LK Gießen"]
["06531003     Buseck",202,"06531003","Buseck","LK Gießen"]
["06531004     Fernwald",203,"06531004","Fernwald","LK Gießen"]
["06531005     Gießen",204,"06531005","Gießen","LK Gießen"]
["06531006     Grünberg",205,"06531006","Grünberg","LK Gießen"]
["06531007     Heuchelheim",206,"06531007","Heuchelheim","LK Gießen"]
["06531008     Hungen",207,"06531008","Hungen","LK Gießen"]
["06531009     Langgöns",208,"06531009","Langgöns","LK Gießen"]
["06531010     Laubach",209,"06531010","Laubach","LK Gießen"]
["06531011     Lich",210,"06531011","Lich","LK Gießen"]
["06531012     Linden",211,"06531012","Linden","LK Gießen"]
["06531013     Lollar",212,"06531013","Lollar","LK Gießen"]
["06531014     Pohlheim",213,"06531014","Pohlheim","LK Gießen"]
["06531015     Rabenau",214,"06531015","Rabenau","LK Gießen"]
["06531016     Reiskirchen",215,"06531016","Reiskirchen","LK Gießen"]
["06531017     Staufenberg",216,"06531017","Staufenberg","LK Gießen"]
["06531018     Wettenberg",217,"06531018","Wettenberg","LK Gießen"]
[]
[{"$f":"CONCATENATE(C232,\"           \",D232)","v":"06532           LK Lahn-Dill"},218,"06532","LK Lahn-Dill","LK Lahn-Dill"]
[{"$f":"CONCATENATE(C233,\"     \",D233)","v":"06532001     Aßlar"},219,"06532001","Aßlar","LK Lahn-Dill"]
["06532002     Bischoffen",220,"06532002","Bischoffen","LK Lahn-Dill"]
["06532003     Braunfels",221,"06532003","Braunfels","LK Lahn-Dill"]
["06532004     Breitscheid",222,"06532004","Breitscheid","LK Lahn-Dill"]
["06532005     Dietzhölztal",223,"06532005","Dietzhölztal","LK Lahn-Dill"]
["06532006     Dillenburg",224,"06532006","Dillenburg","LK Lahn-Dill"]
["06532007     Driedorf",225,"06532007","Driedorf","LK Lahn-Dill"]
["06532008     Ehringshausen",226,"06532008","Ehringshausen","LK Lahn-Dill"]
["06532009     Eschenburg",227,"06532009","Eschenburg","LK Lahn-Dill"]
["06532010     Greifenstein",228,"06532010","Greifenstein","LK Lahn-Dill"]
["06532011     Haiger",229,"06532011","Haiger","LK Lahn-Dill"]
["06532012     Herborn",230,"06532012","Herborn","LK Lahn-Dill"]
["06532013     Hohenahr",231,"06532013","Hohenahr","LK Lahn-Dill"]
["06532014     Hüttenberg",232,"06532014","Hüttenberg","LK Lahn-Dill"]
["06532015     Lahnau",233,"06532015","Lahnau","LK Lahn-Dill"]
["06532016     Leun",234,"06532016","Leun","LK Lahn-Dill"]
["06532017     Mittenaar",235,"06532017","Mittenaar","LK Lahn-Dill"]
["06532018     Schöffengrund",236,"06532018","Schöffengrund","LK Lahn-Dill"]
["06532019     Siegbach",237,"06532019","Siegbach","LK Lahn-Dill"]
["06532020     Sinn",238,"06532020","Sinn","LK Lahn-Dill"]
["06532021     Solms",239,"06532021","Solms","LK Lahn-Dill"]
["06532022     Waldsolms",240,"06532022","Waldsolms","LK Lahn-Dill"]
["06532023     Wetzlar",241,"06532023","Wetzlar","LK Lahn-Dill"]
[]
[{"$f":"CONCATENATE(C257,\"           \",D257)","v":"06533           LK Limburg-Weilburg"},242,"06533","LK Limburg-Weilburg","LK Limburg-Weilburg"]
[{"$f":"CONCATENATE(C258,\"     \",D258)","v":"06533001     Beselich"},243,"06533001","Beselich","LK Limburg-Weilburg"]
["06533002     Brechen",244,"06533002","Brechen","LK Limburg-Weilburg"]
["06533003     Bad Camberg",245,"06533003","Bad Camberg","LK Limburg-Weilburg"]
["06533004     Dornburg",246,"06533004","Dornburg","LK Limburg-Weilburg"]
["06533005     Elbtal",247,"06533005","Elbtal","LK Limburg-Weilburg"]
["06533006     Elz",248,"06533006","Elz","LK Limburg-Weilburg"]
["06533007     Hadamar",249,"06533007","Hadamar","LK Limburg-Weilburg"]
["06533008     Hünfelden",250,"06533008","Hünfelden","LK Limburg-Weilburg"]
["06533009     Limburg an der Lahn",251,"06533009","Limburg an der Lahn","LK Limburg-Weilburg"]
["06533010     Löhnberg",252,"06533010","Löhnberg","LK Limburg-Weilburg"]
["06533011     Mengerskirchen",253,"06533011","Mengerskirchen","LK Limburg-Weilburg"]
["06533012     Merenberg",254,"06533012","Merenberg","LK Limburg-Weilburg"]
["06533013     Runkel",255,"06533013","Runkel","LK Limburg-Weilburg"]
["06533014     Selters (Taunus)",256,"06533014","Selters (Taunus)","LK Limburg-Weilburg"]
["06533015     Villmar",257,"06533015","Villmar","LK Limburg-Weilburg"]
["06533016     Waldbrunn (Westerwald)",258,"06533016","Waldbrunn (Westerwald)","LK Limburg-Weilburg"]
["06533017     Weilburg",259,"06533017","Weilburg","LK Limburg-Weilburg"]
["06533018     Weilmünster",260,"06533018","Weilmünster","LK Limburg-Weilburg"]
["06533019     Weinbach",261,"06533019","Weinbach","LK Limburg-Weilburg"]
[]
[{"$f":"CONCATENATE(C278,\"           \",D278)","v":"06534           LK Marburg-Biedenkopf"},262,"06534","LK Marburg-Biedenkopf","LK Marburg-Biedenkopf"]
[{"$f":"CONCATENATE(C279,\"     \",D279)","v":"06534001     Amöneburg"},263,"06534001","Amöneburg","LK Marburg-Biedenkopf"]
["06534002     Angelburg",264,"06534002","Angelburg","LK Marburg-Biedenkopf"]
["06534003     Bad Endbach",265,"06534003","Bad Endbach","LK Marburg-Biedenkopf"]
["06534004     Biedenkopf",266,"06534004","Biedenkopf","LK Marburg-Biedenkopf"]
["06534005     Breidenbach",267,"06534005","Breidenbach","LK Marburg-Biedenkopf"]
["06534006     Cölbe",268,"06534006","Cölbe","LK Marburg-Biedenkopf"]
["06534007     Dautphetal",269,"06534007","Dautphetal","LK Marburg-Biedenkopf"]
["06534008     Ebsdorfergrund",270,"06534008","Ebsdorfergrund","LK Marburg-Biedenkopf"]
["06534009     Fronhausen",271,"06534009","Fronhausen","LK Marburg-Biedenkopf"]
["06534010     Gladenbach",272,"06534010","Gladenbach","LK Marburg-Biedenkopf"]
["06534011     Kirchhain",273,"06534011","Kirchhain","LK Marburg-Biedenkopf"]
["06534012     Lahntal",274,"06534012","Lahntal","LK Marburg-Biedenkopf"]
["06534013     Lohra",275,"06534013","Lohra","LK Marburg-Biedenkopf"]
["06534014     Marburg",276,"06534014","Marburg","LK Marburg-Biedenkopf"]
["06534015     Münchhausen",277,"06534015","Münchhausen","LK Marburg-Biedenkopf"]
["06534016     Neustadt (Hessen) ",278,"06534016","Neustadt (Hessen) ","LK Marburg-Biedenkopf"]
["06534017     Rauschenberg",279,"06534017","Rauschenberg","LK Marburg-Biedenkopf"]
["06534018     Stadtallendorf",280,"06534018","Stadtallendorf","LK Marburg-Biedenkopf"]
["06534019     Steffenberg",281,"06534019","Steffenberg","LK Marburg-Biedenkopf"]
["06534020     Weimar (Lahn)",282,"06534020","Weimar (Lahn)","LK Marburg-Biedenkopf"]
["06534021     Wetter (Hessen)",283,"06534021","Wetter (Hessen)","LK Marburg-Biedenkopf"]
["06534022     Wohratal",284,"06534022","Wohratal","LK Marburg-Biedenkopf"]
[]
[{"$f":"CONCATENATE(C302,\"           \",D302)","v":"06535           LK Vogelsberg"},285,"06535","LK Vogelsberg","LK Vogelsberg"]
[{"$f":"CONCATENATE(C303,\"     \",D303)","v":"06535001     Alsfeld"},286,"06535001","Alsfeld","LK Vogelsberg"]
["06535002     Antrifttal",287,"06535002","Antrifttal","LK Vogelsberg"]
["06535003     Feldatal",288,"06535003","Feldatal","LK Vogelsberg"]
["06535004     Freiensteinau",289,"06535004","Freiensteinau","LK Vogelsberg"]
["06535005     Gemünden (Felda)",290,"06535005","Gemünden (Felda)","LK Vogelsberg"]
["06535006     Grebenau",291,"06535006","Grebenau","LK Vogelsberg"]
["06535007     Grebenhain",292,"06535007","Grebenhain","LK Vogelsberg"]
["06535008     Herbstein",293,"06535008","Herbstein","LK Vogelsberg"]
["06535009     Homberg (Ohm)  ",294,"06535009","Homberg (Ohm)  ","LK Vogelsberg"]
["06535010     Kirtorf",295,"06535010","Kirtorf","LK Vogelsberg"]
["06535011     Lauterbach (Hessen)",296,"06535011","Lauterbach (Hessen)","LK Vogelsberg"]
["06535012     Lautertal (Vogelsberg)",297,"06535012","Lautertal (Vogelsberg)","LK Vogelsberg"]
["06535013     Mücke",298,"06535013","Mücke","LK Vogelsberg"]
["06535014     Romrod",299,"06535014","Romrod","LK Vogelsberg"]
["06535015     Schlitz",300,"06535015","Schlitz","LK Vogelsberg"]
["06535016     Schotten",301,"06535016","Schotten","LK Vogelsberg"]
["06535017     Schwalmtal",302,"06535017","Schwalmtal","LK Vogelsberg"]
["06535018     Ulrichstein",303,"06535018","Ulrichstein","LK Vogelsberg"]
["06535019     Wartenberg",304,"06535019","Wartenberg","LK Vogelsberg"]
[{"$f":"CONCATENATE(C322,\"          \",D322)","v":"06611          Kassel"},305,"06611","Kassel",""]
[]
[{"$f":"CONCATENATE(C324,\"           \",D324)","v":"06631           LK Fulda"},306,"06631","LK Fulda","LK Fulda"]
[{"$f":"CONCATENATE(C325,\"     \",D325)","v":"06631001     Bad Salzschlirf"},307,"06631001","Bad Salzschlirf","LK Fulda"]
["06631002     Burghaun",308,"06631002","Burghaun","LK Fulda"]
["06631003     Dipperz",309,"06631003","Dipperz","LK Fulda"]
["06631004     Ebersburg",310,"06631004","Ebersburg","LK Fulda"]
["06631005     Ehrenberg (Rhön)",311,"06631005","Ehrenberg (Rhön)","LK Fulda"]
["06631006     Eichenzell",312,"06631006","Eichenzell","LK Fulda"]
["06631007     Eiterfeld",313,"06631007","Eiterfeld","LK Fulda"]
["06631008     Flieden",314,"06631008","Flieden","LK Fulda"]
["06631009     Fulda",315,"06631009","Fulda","LK Fulda"]
["06631010     Gersfeld (Rhön)",316,"06631010","Gersfeld (Rhön)","LK Fulda"]
["06631011     Großenlüder",317,"06631011","Großenlüder","LK Fulda"]
["06631012     Hilders",318,"06631012","Hilders","LK Fulda"]
["06631013     Hofbieber",319,"06631013","Hofbieber","LK Fulda"]
["06631014     Hosenfeld",320,"06631014","Hosenfeld","LK Fulda"]
["06631015     Hünfeld",321,"06631015","Hünfeld","LK Fulda"]
["06631016     Kalbach",322,"06631016","Kalbach","LK Fulda"]
["06631017     Künzell",323,"06631017","Künzell","LK Fulda"]
["06631018     Neuhof",324,"06631018","Neuhof","LK Fulda"]
["06631019     Nüsttal",325,"06631019","Nüsttal","LK Fulda"]
["06631020     Petersberg",326,"06631020","Petersberg","LK Fulda"]
["06631021     Poppenhausen (Wasserkuppe) ",327,"06631021","Poppenhausen (Wasserkuppe) ","LK Fulda"]
["06631022     Rasdorf",328,"06631022","Rasdorf","LK Fulda"]
["06631023     Tann (Rhön)",329,"06631023","Tann (Rhön)","LK Fulda"]
[]
[{"$f":"CONCATENATE(C349,\"           \",D349)","v":"06632           LK Hersfeld-Rotenburg"},330,"06632","LK Hersfeld-Rotenburg","LK Hersfeld-Rotenburg"]
[{"$f":"CONCATENATE(C350,\"     \",D350)","v":"06632001     Alheim"},331,"06632001","Alheim","LK Hersfeld-Rotenburg"]
["06632002     Bad Hersfeld",332,"06632002","Bad Hersfeld","LK Hersfeld-Rotenburg"]
["06632003     Bebra",333,"06632003","Bebra","LK Hersfeld-Rotenburg"]
["06632004     Breitenbach a. Herzberg",334,"06632004","Breitenbach a. Herzberg","LK Hersfeld-Rotenburg"]
["06632005     Cornberg",335,"06632005","Cornberg","LK Hersfeld-Rotenburg"]
["06632006     Friedewald",336,"06632006","Friedewald","LK Hersfeld-Rotenburg"]
["06632007     Hauneck",337,"06632007","Hauneck","LK Hersfeld-Rotenburg"]
["06632008     Haunetal",338,"06632008","Haunetal","LK Hersfeld-Rotenburg"]
["06632009     Heringen (Werra)",339,"06632009","Heringen (Werra)","LK Hersfeld-Rotenburg"]
["06632010     Hohenroda",340,"06632010","Hohenroda","LK Hersfeld-Rotenburg"]
["06632011     Kirchheim",341,"06632011","Kirchheim","LK Hersfeld-Rotenburg"]
["06632012     Ludwigsau",342,"06632012","Ludwigsau","LK Hersfeld-Rotenburg"]
["06632013     Nentershausen",343,"06632013","Nentershausen","LK Hersfeld-Rotenburg"]
["06632014     Neuenstein",344,"06632014","Neuenstein","LK Hersfeld-Rotenburg"]
["06632015     Niederaula",345,"06632015","Niederaula","LK Hersfeld-Rotenburg"]
["06632016     Philippsthal",346,"06632016","Philippsthal","LK Hersfeld-Rotenburg"]
["06632017     Ronshausen",347,"06632017","Ronshausen","LK Hersfeld-Rotenburg"]
["06632018     Rotenburg a.d. Fulda",348,"06632018","Rotenburg a.d. Fulda","LK Hersfeld-Rotenburg"]
["06632019     Schenklengsfeld",349,"06632019","Schenklengsfeld","LK Hersfeld-Rotenburg"]
["06632020     Wildeck",350,"06632020","Wildeck","LK Hersfeld-Rotenburg"]
[]
[{"$f":"CONCATENATE(C371,\"           \",D371)","v":"06633           LK Kassel"},351,"06633","LK Kassel","LK Kassel"]
[{"$f":"CONCATENATE(C372,\"     \",D372)","v":"06633001     Ahnatal"},352,"06633001","Ahnatal","LK Kassel"]
["06633002     Bad Karlshafen",353,"06633002","Bad Karlshafen","LK Kassel"]
["06633003     Baunatal       ",354,"06633003","Baunatal       ","LK Kassel"]
["06633004     Breuna",355,"06633004","Breuna","LK Kassel"]
["06633005     Calden",356,"06633005","Calden","LK Kassel"]
["06633006     Bad Emstal",357,"06633006","Bad Emstal","LK Kassel"]
["06633007     Espenau",358,"06633007","Espenau","LK Kassel"]
["06633008     Fuldabrück",359,"06633008","Fuldabrück","LK Kassel"]
["06633009     Fuldatal",360,"06633009","Fuldatal","LK Kassel"]
["06633010     Grebenstein",361,"06633010","Grebenstein","LK Kassel"]
["06633011     Habichtswald",362,"06633011","Habichtswald","LK Kassel"]
["06633012     Helsa",363,"06633012","Helsa","LK Kassel"]
["06633013     Hofgeismar",364,"06633013","Hofgeismar","LK Kassel"]
["06633014     Immenhausen",365,"06633014","Immenhausen","LK Kassel"]
["06633015     Kaufungen",366,"06633015","Kaufungen","LK Kassel"]
["06633016     Liebenau",367,"06633016","Liebenau","LK Kassel"]
["06633017     Lohfelden",368,"06633017","Lohfelden","LK Kassel"]
["06633018     Naumburg",369,"06633018","Naumburg","LK Kassel"]
["06633019     Nieste",370,"06633019","Nieste","LK Kassel"]
["06633020     Niestetal",371,"06633020","Niestetal","LK Kassel"]
["06633021     Oberweser",372,"06633021","Oberweser","LK Kassel"]
["06633022     Reinhardshagen",373,"06633022","Reinhardshagen","LK Kassel"]
["06633023     Schauenburg",374,"06633023","Schauenburg","LK Kassel"]
["06633024     Söhrewald",375,"06633024","Söhrewald","LK Kassel"]
["06633025     Trendelburg",376,"06633025","Trendelburg","LK Kassel"]
["06633026     Vellmar",377,"06633026","Vellmar","LK Kassel"]
["06633027     Wahlsburg",378,"06633027","Wahlsburg","LK Kassel"]
["06633028     Wolfhagen",379,"06633028","Wolfhagen","LK Kassel"]
["06633029     Zierenberg",380,"06633029","Zierenberg","LK Kassel"]
[]
[{"$f":"CONCATENATE(C402,\"           \",D402)","v":"06634           LK Schwalm-Eder"},381,"06634","LK Schwalm-Eder","LK Schwalm-Eder"]
[{"$f":"CONCATENATE(C403,\"     \",D403)","v":"06634001     Borken (Hessen)"},382,"06634001","Borken (Hessen)","LK Schwalm-Eder"]
["06634002     Edermünde",383,"06634002","Edermünde","LK Schwalm-Eder"]
["06634003     Felsberg",384,"06634003","Felsberg","LK Schwalm-Eder"]
["06634004     Frielendorf",385,"06634004","Frielendorf","LK Schwalm-Eder"]
["06634005     Fritzlar",386,"06634005","Fritzlar","LK Schwalm-Eder"]
["06634006     Gilserberg",387,"06634006","Gilserberg","LK Schwalm-Eder"]
["06634007     Gudensberg",388,"06634007","Gudensberg","LK Schwalm-Eder"]
["06634008     Guxhagen",389,"06634008","Guxhagen","LK Schwalm-Eder"]
["06634009     Homberg (Efze)",390,"06634009","Homberg (Efze)","LK Schwalm-Eder"]
["06634010     Jesberg",391,"06634010","Jesberg","LK Schwalm-Eder"]
["06634011     Knüllwald",392,"06634011","Knüllwald","LK Schwalm-Eder"]
["06634012     Körle",393,"06634012","Körle","LK Schwalm-Eder"]
["06634013     Malsfeld",394,"06634013","Malsfeld","LK Schwalm-Eder"]
["06634014     Melsungen",395,"06634014","Melsungen","LK Schwalm-Eder"]
["06634015     Morschen",396,"06634015","Morschen","LK Schwalm-Eder"]
["06634016     Neuental",397,"06634016","Neuental","LK Schwalm-Eder"]
["06634017     Neukirchen",398,"06634017","Neukirchen","LK Schwalm-Eder"]
["06634018     Niedenstein",399,"06634018","Niedenstein","LK Schwalm-Eder"]
["06634019     Oberaula",400,"06634019","Oberaula","LK Schwalm-Eder"]
["06634020     Ottrau",401,"06634020","Ottrau","LK Schwalm-Eder"]
["06634021     Schrecksbach",402,"06634021","Schrecksbach","LK Schwalm-Eder"]
["06634022     Schwalmstadt",403,"06634022","Schwalmstadt","LK Schwalm-Eder"]
["06634023     Schwarzenborn",404,"06634023","Schwarzenborn","LK Schwalm-Eder"]
["06634024     Spangenberg",405,"06634024","Spangenberg","LK Schwalm-Eder"]
["06634025     Wabern",406,"06634025","Wabern","LK Schwalm-Eder"]
["06634026     Willingshausen",407,"06634026","Willingshausen","LK Schwalm-Eder"]
["06634027     Bad Zwesten",408,"06634027","Bad Zwesten","LK Schwalm-Eder"]
[]
[{"$f":"CONCATENATE(C431,\"           \",D431)","v":"06635           LK Waldeck-Frankenberg"},409,"06635","LK Waldeck-Frankenberg","LK Waldeck-Frankenberg"]
[{"$f":"CONCATENATE(C432,\"     \",D432)","v":"06635001     Allendorf (Eder)"},410,"06635001","Allendorf (Eder)","LK Waldeck-Frankenberg"]
["06635002     Bad Arolsen",411,"06635002","Bad Arolsen","LK Waldeck-Frankenberg"]
["06635003     Bad Wildungen",412,"06635003","Bad Wildungen","LK Waldeck-Frankenberg"]
["06635004     Battenberg (Eder)",413,"06635004","Battenberg (Eder)","LK Waldeck-Frankenberg"]
["06635005     Bromskirchen",414,"06635005","Bromskirchen","LK Waldeck-Frankenberg"]
["06635006     Burgwald",415,"06635006","Burgwald","LK Waldeck-Frankenberg"]
["06635007     Diemelsee",416,"06635007","Diemelsee","LK Waldeck-Frankenberg"]
["06635008     Diemelstadt",417,"06635008","Diemelstadt","LK Waldeck-Frankenberg"]
["06635009     Edertal",418,"06635009","Edertal","LK Waldeck-Frankenberg"]
["06635010     Frankenau",419,"06635010","Frankenau","LK Waldeck-Frankenberg"]
["06635011     Frankenberg (Eder)",420,"06635011","Frankenberg (Eder)","LK Waldeck-Frankenberg"]
["06635012     Gemünden (Wohra)",421,"06635012","Gemünden (Wohra)","LK Waldeck-Frankenberg"]
["06635013     Haina (Kloster)",422,"06635013","Haina (Kloster)","LK Waldeck-Frankenberg"]
["06635014     Hatzfeld (Eder)",423,"06635014","Hatzfeld (Eder)","LK Waldeck-Frankenberg"]
["06635015     Korbach",424,"06635015","Korbach","LK Waldeck-Frankenberg"]
["06635016     Lichtenfels",425,"06635016","Lichtenfels","LK Waldeck-Frankenberg"]
["06635017     Rosenthal",426,"06635017","Rosenthal","LK Waldeck-Frankenberg"]
["06635018     Twistetal",427,"06635018","Twistetal","LK Waldeck-Frankenberg"]
["06635019     Vöhl",428,"06635019","Vöhl","LK Waldeck-Frankenberg"]
["06635020     Volkmarsen",429,"06635020","Volkmarsen","LK Waldeck-Frankenberg"]
["06635021     Waldeck",430,"06635021","Waldeck","LK Waldeck-Frankenberg"]
["06635022     Willingen (Upland)",431,"06635022","Willingen (Upland)","LK Waldeck-Frankenberg"]
[]
[{"$f":"CONCATENATE(C455,\"           \",D455)","v":"06636           LK Werra-Meißner"},432,"06636","LK Werra-Meißner","LK Werra-Meißner"]
[{"$f":"CONCATENATE(C456,\"     \",D456)","v":"06636001     Bad Sooden-Allendorf"},433,"06636001","Bad Sooden-Allendorf","LK Werra-Meißner"]
["06636002     Berkatal",434,"06636002","Berkatal","LK Werra-Meißner"]
["06636003     Eschwege",435,"06636003","Eschwege","LK Werra-Meißner"]
["06636004     Großalmerode",436,"06636004","Großalmerode","LK Werra-Meißner"]
["06636005     Herleshausen",437,"06636005","Herleshausen","LK Werra-Meißner"]
["06636006     Hessisch Lichtenau",438,"06636006","Hessisch Lichtenau","LK Werra-Meißner"]
["06636007     Meinhard",439,"06636007","Meinhard","LK Werra-Meißner"]
["06636008     Meißner",440,"06636008","Meißner","LK Werra-Meißner"]
["06636009     Neu-Eichenberg",441,"06636009","Neu-Eichenberg","LK Werra-Meißner"]
["06636010     Ringgau",442,"06636010","Ringgau","LK Werra-Meißner"]
["06636011     Sontra",443,"06636011","Sontra","LK Werra-Meißner"]
["06636012     Waldkappel",444,"06636012","Waldkappel","LK Werra-Meißner"]
["06636013     Wanfried",445,"06636013","Wanfried","LK Werra-Meißner"]
["06636014     Wehretal",446,"06636014","Wehretal","LK Werra-Meißner"]
["06636015     Weißenborn",447,"06636015","Weißenborn","LK Werra-Meißner"]
["06636016     Witzenhausen",448,"06636016","Witzenhausen","LK Werra-Meißner"]

{"sheet":"Werteliste Schulform","index":7,"n_rows":10,"n_cols":3,"rows_kept":10,"cut":false,"hidden":true,"merged":[]}
["Werteliste Schulform"]
[]
["bitte auswählen",1,"Keine Auswahl getroffen"]
["Grundschule",2,"Grundschule"]
["Haupt- oder Realschule",3,"Haupt- oder Realschule"]
["Gymnasium",4,"Gymnasium"]
["Gesamtschule",5,"Gesamtschule"]
["Berufsschule",6,"Berufsschule"]
["Förderschule",7,"Förderschule"]
["verschiedene Schulen",8,"verschiedene Schulen"]

{"sheet":"antragsberechtigt B","index":8,"n_rows":274,"n_cols":26,"rows_kept":274,"cut":false,"hidden":true,"merged":[]}
["Bitte auswählen!",null,null,1,"Bitte auswählen!"]
["Ahnatal                       ","LK Kassel","06633001",2,"AHNATAL                       ",6633001,"ov",633,null,431000,{"$f":"(LEFT(J2,3))*1","v":431},null,"LK Bergstraße",null,1,633001,"ov","633","AHNATAL                       ",{"$f":"EXACT(A2,S2)","v":false},null,6633001,{"$f":"VLOOKUP(C2,'Werteliste IDENT_LAND'!$C$1:$G$505,5,FALSE)","v":"Ahnatal"},"AHNATAL                       ",{"$f":"PROPER(X2)","v":"Ahnatal                       "},"Ahnatal                       "]
["Alheim                        ","LK Hersfeld-Rotenburg","06632001",3,"ALHEIM                        ",6632001,"l",632,null,432000,432,null,"LK Darmstadt-Dieburg",null,null,632001,"l","632","ALHEIM                        ",{"$f":"EXACT(A3,S3)","v":false},null,6632001,null,"ALHEIM                        ",{"$f":"PROPER(X3)","v":"Alheim                        "},"Alheim                        "]
["Allendorf (Lumda)             ","LK Gießen","06531001",4,"ALLENDORF (LUMDA)             ",6531001,"l",531,null,436000,436,null,"LK Main-Taunus",null,null,531001,"l","531","ALLENDORF (LUMDA)             ",false,null,6531001,null,"ALLENDORF (LUMDA)             ","Allendorf (Lumda)             ","Allendorf (Lumda)             "]
["Alsfeld                       ","LK Vogelsberg","06535001",5,"ALSFELD                       ",6535001,"l",535,null,437000,437,null,"LK Odenwaldkreis",null,null,535001,"l","535","ALSFELD                       ",false,null,6535001,null,"ALSFELD                       ","Alsfeld                       ","Alsfeld                       "]
["Amoeneburg                    ","LK Marburg-Biedenkopf","06534001",6,"AMOENEBURG                    ",6534001,"l",534,null,438000,438,null,"LK Offenbach",null,null,534001,"l","534","AMOENEBURG                    ",false,null,6534001,null,"AMOENEBURG                    ","Amoeneburg                    ","Amoeneburg                    "]
["Angelburg                     ","LK Marburg-Biedenkopf","06534002",7,"ANGELBURG                     ",6534002,"l",534,null,439000,439,null,"LK Rheingau-Taunus",null,null,534002,"l","534","ANGELBURG                     ",false,null,6534002,null,"ANGELBURG                     ","Angelburg                     ","Angelburg                     "]
["Antrifttal                    ","LK Vogelsberg","06535002",8,"ANTRIFTTAL                    ",6535002,"l",535,null,440000,440,null,"LK Wetterau",null,null,535002,"l","535","ANTRIFTTAL                    ",false,null,6535002,null,"ANTRIFTTAL                    ","Antrifttal                    ","Antrifttal                    "]
["Bad Arolsen                   ","LK Waldeck-Frankenberg","06635002",9,"BAD AROLSEN                   ",6635002,"l",635,null,533000,533,null,"LK Limburg-Weilburg",null,null,635002,"l","635","BAD AROLSEN                   ",false,null,6635002,null,"BAD AROLSEN                   ","Bad Arolsen                   ","Bad Arolsen                   "]
["Bad Emstal                    ","LK Kassel","06633006",10,"BAD EMSTAL                    ",6633006,"o",633,null,535000,535,null,"LK Vogelsberg",null,null,633006,"o","633","BAD EMSTAL                    ",false,null,6633006,null,"BAD EMSTAL                    ","Bad Emstal                    ","Bad Emstal                    "]
["Bad Endbach                   ","LK Marburg-Biedenkopf","06534003",11,"BAD ENDBACH                   ",6534003,"l",534,null,632000,632,null,"LK Hersfeld-Rotenburg",null,null,534003,"l","534","BAD ENDBACH                   ",false,null,6534003,null,"BAD ENDBACH                   ","Bad Endbach                   ","Bad Endbach                   "]
["Bad Hersfeld                  ","LK Hersfeld-Rotenburg","06632002",12,"BAD HERSFELD                  ",6632002,"l",632,null,633000,633,null,"LK Kassel",null,null,632002,"l","632","BAD HERSFELD                  ",false,null,6632002,null,"BAD HERSFELD                  ","Bad Hersfeld                  ","Bad Hersfeld                  "]
["Bad Karlshafen                ","LK Kassel","06633002",13,"BAD KARLSHAFEN                ",6633002,"l",633,null,634000,634,null,"LK Schwalm-Eder",null,null,633002,"l","633","BAD KARLSHAFEN                ",false,null,6633002,null,"BAD KARLSHAFEN                ","Bad Karlshafen                ","Bad Karlshafen                "]
["Bad Koenig                    ","LK Odenwaldkreis","06437001",14,"BAD KOENIG                    ",6437001,"l",437,null,635000,635,null,"LK Waldeck-Frankenberg",null,null,437001,"l","437","BAD KOENIG                    ",false,null,6437001,null,"BAD KOENIG                    ","Bad Koenig                    ","Bad Koenig                    "]
["Bad Nauheim                   ","LK Wetterau","06440002",15,"BAD NAUHEIM                   ",6440002,"o",440,null,636000,636,null,"LK Werra-Meißner",null,null,440002,"o","440","BAD NAUHEIM                   ",false,null,6440002,null,"BAD NAUHEIM                   ","Bad Nauheim                   ","Bad Nauheim                   "]
["Bad Orb                       ","LK Main-Kinzig","06435001",16,"BAD ORB                       ",6435001,"l",435,null,433000,433,null,"LK Groß-Gerau",null,null,435001,"l","435","BAD ORB                       ",false,null,6435001,null,"BAD ORB                       ","Bad Orb                       ","Bad Orb                       "]
["Bad Schwalbach                ","LK Rheingau-Taunus","06439002",17,"BAD SCHWALBACH                ",6439002,"o",439,null,434000,434,null,"LK Hochtaunus",null,null,439002,"o","439","BAD SCHWALBACH                ",false,null,6439002,null,"BAD SCHWALBACH                ","Bad Schwalbach                ","Bad Schwalbach                "]
["Bad Soden-Salmuenster         ","LK Main-Kinzig","06435002",18,"BAD SODEN-SALMUENSTER         ",6435002,"l",435,null,435000,435,null,"LK Main-Kinzig",null,null,435002,"l","435","BAD SODEN-SALMUENSTER         ",false,null,6435002,null,"BAD SODEN-SALMUENSTER         ","Bad Soden-Salmuenster         ","Bad Soden-Salmuenster         "]
["Bad Sooden-Allendorf          ","LK Werra-Meißner","06636001",19,"BAD SOODEN-ALLENDORF          ",6636001,"l",636,null,531000,531,null,"LK Gießen",null,null,636001,"l","636","BAD SOODEN-ALLENDORF          ",false,null,6636001,null,"BAD SOODEN-ALLENDORF          ","Bad Sooden-Allendorf          ","Bad Sooden-Allendorf          "]
["Bad Wildungen                 ","LK Waldeck-Frankenberg","06635003",20,"BAD WILDUNGEN                 ",6635003,"l",635,null,532000,532,null,"LK Lahn-Dill",null,null,635003,"l","635","BAD WILDUNGEN                 ",false,null,6635003,null,"BAD WILDUNGEN                 ","Bad Wildungen                 ","Bad Wildungen                 "]
["Bad Zwesten                   ","LK Schwalm-Eder","06634027",21,"BAD ZWESTEN                   ",6634027,"l",634,null,534000,534,null,"LK Marburg-Biedenkopf",null,null,634027,"l","634","BAD ZWESTEN                   ",false,null,6634027,null,"BAD ZWESTEN                   ","Bad Zwesten                   ","Bad Zwesten                   "]
["Bebra                         ","LK Hersfeld-Rotenburg","06632003",22,"BEBRA                         ",6632003,"l",632,null,631000,631,null,"LK Fulda",null,null,632003,"l","632","BEBRA                         ",false,null,6632003,null,"BEBRA                         ","Bebra                         ","Bebra                         "]
["Beselich                      ","LK Limburg-Weilburg","06533001",23,"BESELICH                      ",6533001,"l",533,null,412000,412,null,"FRANKFURT MAIN",null,null,533001,"l","533","BESELICH                      ",false,null,6533001,null,"BESELICH                      ","Beselich                      ","Beselich                      "]
["Birkenau                      ","LK Bergstraße","06431004",24,"BIRKENAU                      ",6431004,"ov",431,null,413000,413,null,"OFFENBACH AM MAIN             ",null,null,431004,"ov","431","BIRKENAU                      ",false,null,6431004,null,"BIRKENAU                      ","Birkenau                      ","Birkenau                      "]
["Bischofsheim                  ","LK Groß-Gerau","06433002",25,"BISCHOFSHEIM                  ",6433002,"ov",433,null,414000,414,null,"WIESBADEN",null,null,433002,"ov","433","BISCHOFSHEIM                  ",false,null,6433002,null,"BISCHOFSHEIM                  ","Bischofsheim                  ","Bischofsheim                  "]
["Borken (Hessen)               ","LK Schwalm-Eder","06634001",26,"BORKEN (HESSEN)               ",6634001,"o",634,null,611000,611,null,"KASSEL                        ",null,null,634001,"o","634","BORKEN (HESSEN)               ",false,null,6634001,null,"BORKEN (HESSEN)               ","Borken (Hessen)               ","Borken (Hessen)               "]
["Brachttal                     ","LK Main-Kinzig","06435005",27,"BRACHTTAL                     ",6435005,"l",435,null,null,null,null,null,null,null,435005,"l","435","BRACHTTAL                     ",false,null,6435005,null,"BRACHTTAL                     ","Brachttal                     ","Brachttal                     "]
["Braunfels                     ","LK Lahn-Dill","06532003",28,"BRAUNFELS                     ",6532003,"o",532,null,"0",6435005,{"$f":"CONCATENATE($J$28,K28)","v":"06435005"},"06435005",null,null,532003,"o","532","BRAUNFELS                     ",false,null,6532003,null,"BRAUNFELS                     ","Braunfels                     ","Braunfels                     "]
["Breitenbach a. Herzberg        ","LK Hersfeld-Rotenburg","06632004",29,"Breitenbach a. Herzberg        ",6632004,"l",632,null,null,6532003,{"$f":"CONCATENATE($J$28,K29)","v":"06532003"},null,null,null,632004,"l","632","BREITENBACH A.HERZBERG        ",false,null,6632004,null,"BREITENBACH A.HERZBERG        ","Breitenbach A.Herzberg        ","Breitenbach a. Herzberg        "]
["Breuna                        ","LK Kassel","06633004",30,"BREUNA                        ",6633004,"o",633,null,null,6632004,"06632004",null,null,null,633004,"o","633","BREUNA                        ",false,null,6633004,null,"BREUNA                        ","Breuna                        ","Breuna                        "]
["Brombachtal                   ","LK Odenwaldkreis","06437005",31,"BROMBACHTAL                   ",6437005,"l",437,null,null,6633004,"06633004",null,null,null,437005,"l","437","BROMBACHTAL                   ",false,null,6437005,null,"BROMBACHTAL                   ","Brombachtal                   ","Brombachtal                   "]
["Bromskirchen                  ","LK Waldeck-Frankenberg","06635005",32,"BROMSKIRCHEN                  ",6635005,"l",635,null,null,6437005,"06437005",null,null,null,635005,"l","635","BROMSKIRCHEN                  ",false,null,6635005,null,"BROMSKIRCHEN                  ","Bromskirchen                  ","Bromskirchen                  "]
["Bruchkoebel                   ","LK Main-Kinzig","06435006",33,"BRUCHKOEBEL                   ",6435006,"ov",435,null,null,6635005,"06635005",null,null,null,435006,"ov","435","BRUCHKOEBEL                   ",false,null,6435006,null,"BRUCHKOEBEL                   ","Bruchkoebel                   ","Bruchkoebel                   "]
["Buedingen                     ","LK Wetterau","06440004",34,"BUEDINGEN                     ",6440004,"l",440,null,null,6435006,"06435006",null,null,null,440004,"l","440","BUEDINGEN                     ",false,null,6440004,null,"BUEDINGEN                     ","Buedingen                     ","Buedingen                     "]
["Buerstadt                     ","LK Bergstraße","06431005",35,"BUERSTADT                     ",6431005,"ov",431,null,null,6440004,"06440004",null,null,null,431005,"ov","431","BUERSTADT                     ",false,null,6431005,null,"BUERSTADT                     ","Buerstadt                     ","Buerstadt                     "]
["Butzbach                      ","LK Wetterau","06440005",36,"BUTZBACH                      ",6440005,"o",440,null,null,6431005,"06431005",null,null,null,440005,"o","440","BUTZBACH                      ",false,null,6440005,null,"BUTZBACH                      ","Butzbach                      ","Butzbach                      "]
["Cornberg                      ","LK Hersfeld-Rotenburg","06632005",37,"CORNBERG                      ",6632005,"l",632,null,null,6440005,"06440005",null,null,null,632005,"l","632","CORNBERG                      ",false,null,6632005,null,"CORNBERG                      ","Cornberg                      ","Cornberg                      "]
["Dautphetal                    ","LK Marburg-Biedenkopf","06534007",38,"DAUTPHETAL                    ",6534007,"l",534,null,null,6632005,"06632005",null,null,null,534007,"l","534","DAUTPHETAL                    ",false,null,6534007,null,"DAUTPHETAL                    ","Dautphetal                    ","Dautphetal                    "]
["Diemelsee                     ","LK Waldeck-Frankenberg","06635007",39,"DIEMELSEE                     ",6635007,"l",635,null,null,6534007,"06534007",null,null,null,635007,"l","635","DIEMELSEE                     ",false,null,6635007,null,"DIEMELSEE                     ","Diemelsee                     ","Diemelsee                     "]
["Dietzenbach                   ","LK Offenbach","06438001",40,"DIETZENBACH                   ",6438001,"ov",438,null,null,6635007,"06635007",null,null,null,438001,"ov","438","DIETZENBACH                   ",false,null,6438001,null,"DIETZENBACH                   ","Dietzenbach                   ","Dietzenbach                   "]
["Dillenburg                    ","LK Lahn-Dill","06532006",41,"DILLENBURG                    ",6532006,"o",532,null,null,6438001,"06438001",null,null,null,532006,"o","532","DILLENBURG                    ",false,null,6532006,null,"DILLENBURG                    ","Dillenburg                    ","Dillenburg                    "]
["Dipperz                       ","LK Fulda","06631003",42,"DIPPERZ                       ",6631003,"l",631,null,null,6532006,"06532006",null,null,null,631003,"l","631","DIPPERZ                       ",false,null,6631003,null,"DIPPERZ                       ","Dipperz                       ","Dipperz                       "]
["Dornburg                      ","LK Limburg-Weilburg","06533004",43,"DORNBURG                      ",6533004,"l",533,null,null,6631003,"06631003",null,null,null,533004,"l","533","DORNBURG                      ",false,null,6533004,null,"DORNBURG                      ","Dornburg                      ","Dornburg                      "]
["Ebersburg                     ","LK Fulda","06631004",44,"EBERSBURG                     ",6631004,"l",631,null,null,6533004,"06533004",null,null,null,631004,"l","631","EBERSBURG                     ",false,null,6631004,null,"EBERSBURG                     ","Ebersburg                     ","Ebersburg                     "]
["Ebsdorfergrund                ","LK Marburg-Biedenkopf","06534008",45,"EBSDORFERGRUND                ",6534008,"l",534,null,null,6631004,"06631004",null,null,null,534008,"l","534","EBSDORFERGRUND                ",false,null,6534008,null,"EBSDORFERGRUND                ","Ebsdorfergrund                ","Ebsdorfergrund                "]
["Edermuende                    ","LK Schwalm-Eder","06634002",46,"EDERMUENDE                    ",6634002,"ov",634,null,null,6534008,"06534008",null,null,null,634002,"ov","634","EDERMUENDE                    ",false,null,6634002,null,"EDERMUENDE                    ","Edermuende                    ","Edermuende                    "]
["Edertal                       ","LK Waldeck-Frankenberg","06635009",47,"EDERTAL                       ",6635009,"l",635,null,null,6634002,"06634002",null,null,null,635009,"l","635","EDERTAL                       ",false,null,6635009,null,"EDERTAL                       ","Edertal                       ","Edertal                       "]
["Ehrenberg (Rhön)","LK Fulda","06631005",48,"Ehrenberg (Rhön)",6631005,"l",631,null,null,6635009,"06635009",null,null,null,631005,"l","631","EHRENBERG(RHOEN)              ",false,null,6631005,null,"EHRENBERG(RHOEN)              ","Ehrenberg(Rhoen)              ","Ehrenberg (Rhoen)              "]
["Elbtal                        ","LK Limburg-Weilburg","06533005",49,"ELBTAL                        ",6533005,"l",533,null,null,6631005,"06631005",null,null,null,533005,"l","533","ELBTAL                        ",false,null,6533005,null,"ELBTAL                        ","Elbtal                        ","Elbtal                        "]
["Erbach                        ","LK Odenwaldkreis","06437006",50,"ERBACH                        ",6437006,"l",437,null,null,6533005,"06533005",null,null,null,437006,"l","437","ERBACH                        ",false,null,6437006,null,"ERBACH                        ","Erbach                        ","Erbach                        "]
["Erlensee                      ","LK Main-Kinzig","06435007",51,"ERLENSEE                      ",6435007,"ov",435,null,null,6437006,"06437006",null,null,null,435007,"ov","435","ERLENSEE                      ",false,null,6435007,null,"ERLENSEE                      ","Erlensee                      ","Erlensee                      "]
["Erzhausen","LK Darmstadt-Dieburg","06432006",52,"ERZHAUSEN",6432006,null,null,null,null,6435007,"06435007",null,null,null,null,null,null,null,null,null,null,null,"ERZHAUSEN","Erzhausen","Erzhausen"]
["Eschwege                      ","LK Werra-Meißner","06636003",53,"ESCHWEGE                      ",6636003,"l",636,null,null,6432006,"06432006",null,null,null,636003,"l","636","ESCHWEGE                      ",{"$f":"EXACT(A53,S53)","v":false},null,6636003,null,"ESCHWEGE                      ","Eschwege                      ","Eschwege                      "]
["Espenau                       ","LK Kassel","06633007",54,"ESPENAU                       ",6633007,"ov",633,null,null,6636003,"06636003",null,null,null,633007,"ov","633","ESPENAU                       ",false,null,6633007,null,"ESPENAU                       ","Espenau                       ","Espenau                       "]
["Feldatal                      ","LK Vogelsberg","06535003",55,"FELDATAL                      ",6535003,"l",535,null,null,6633007,"06633007",null,null,null,535003,"l","535","FELDATAL                      ",false,null,6535003,null,"FELDATAL                      ","Feldatal                      ","Feldatal                      "]
["Felsberg                      ","LK Schwalm-Eder","06634003",56,"FELSBERG                      ",6634003,"o",634,null,null,6535003,"06535003",null,null,null,634003,"o","634","FELSBERG                      ",false,null,6634003,null,"FELSBERG                      ","Felsberg                      ","Felsberg                      "]
["Fischbachtal                  ","LK Darmstadt-Dieburg","06432007",57,"FISCHBACHTAL                  ",6432007,"o",432,null,null,6634003,"06634003",null,null,null,432007,"o","432","FISCHBACHTAL                  ",false,null,6432007,null,"FISCHBACHTAL                  ","Fischbachtal                  ","Fischbachtal                  "]
["Flieden                       ","LK Fulda","06631008",58,"FLIEDEN                       ",6631008,"l",631,null,null,6432007,"06432007",null,null,null,631008,"l","631","FLIEDEN                       ",false,null,6631008,null,"FLIEDEN                       ","Flieden                       ","Flieden                       "]
["Floersbachtal                 ","LK Main-Kinzig","06435008",59,"FLOERSBACHTAL                 ",6435008,"l",435,null,null,6631008,"06631008",null,null,null,435008,"l","435","FLOERSBACHTAL                 ",false,null,6435008,null,"FLOERSBACHTAL                 ","Floersbachtal                 ","Floersbachtal                 "]
["Floersheim am Main            ","LK Main-Taunus","06436004",60,"FLOERSHEIM AM MAIN            ",6436004,"ov",436,null,null,6435008,"06435008",null,null,null,436004,"ov","436","FLOERSHEIM AM MAIN            ",false,null,6436004,null,"FLOERSHEIM AM MAIN            ","Floersheim Am Main            ","Floersheim am Main            "]
["Florstadt                     ","LK Wetterau","06440007",61,"FLORSTADT                     ",6440007,"o",440,null,null,6436004,"06436004",null,null,null,440007,"o","440","FLORSTADT                     ",false,null,6440007,null,"FLORSTADT                     ","Florstadt                     ","Florstadt                     "]
["Frankenau                     ","LK Waldeck-Frankenberg","06635010",62,"FRANKENAU                     ",6635010,"l",635,null,null,6440007,"06440007",null,null,null,635010,"l","635","FRANKENAU                     ",false,null,6635010,null,"FRANKENAU                     ","Frankenau                     ","Frankenau                     "]
["Frankenberg (Eder)            ","LK Waldeck-Frankenberg","06635011",63,"FRANKENBERG (EDER)            ",6635011,"l",635,null,null,6635010,"06635010",null,null,null,635011,"l","635","FRANKENBERG (EDER)            ",false,null,6635011,null,"FRANKENBERG (EDER)            ","Frankenberg (Eder)            ","Frankenberg (Eder)            "]
["Freiensteinau                 ","LK Vogelsberg","06535004",64,"FREIENSTEINAU                 ",6535004,"l",535,null,null,6635011,"06635011",null,null,null,535004,"l","535","FREIENSTEINAU                 ",false,null,6535004,null,"FREIENSTEINAU                 ","Freiensteinau                 ","Freiensteinau                 "]
["Freigericht                   ","LK Main-Kinzig","06435009",65,"FREIGERICHT                   ",6435009,"o",435,null,null,6535004,"06535004",null,null,null,435009,"o","435","FREIGERICHT                   ",false,null,6435009,null,"FREIGERICHT                   ","Freigericht                   ","Freigericht                   "]
["Friedberg (Hessen)            ","LK Wetterau","06440008",66,"FRIEDBERG (HESSEN)            ",6440008,"o",440,null,null,6435009,"06435009",null,null,null,440008,"o","440","FRIEDBERG (HESSEN)            ",false,null,6440008,null,"FRIEDBERG (HESSEN)            ",{"$f":"PROPER(X66)","v":"Friedberg (Hessen)            "},"Friedberg (Hessen)            "]
["Frielendorf                   ","LK Schwalm-Eder","06634004",67,"FRIELENDORF                   ",6634004,"l",634,null,null,6440008,"06440008",null,null,null,634004,"l","634","FRIELENDORF                   ",false,null,6634004,null,"FRIELENDORF                   ","Frielendorf                   ","Frielendorf                   "]
["Fritzlar                      ","LK Schwalm-Eder","06634005",68,"FRITZLAR                      ",6634005,"o",634,null,null,6634004,"06634004",null,null,null,634005,"o","634","FRITZLAR                      ",false,null,6634005,null,"FRITZLAR                      ","Fritzlar                      ","Fritzlar                      "]
["Fuerth                        ","LK Bergstraße","06431007",69,"FUERTH                        ",6431007,"o",431,null,null,6634005,"06634005",null,null,null,431007,"o","431","FUERTH                        ",false,null,6431007,null,"FUERTH                        ","Fuerth                        ","Fuerth                        "]
["Fulda                         ","LK Fulda","06631009",70,"FULDA                         ",6631009,"l",631,null,null,6431007,"06431007",null,null,null,631009,"l","631","FULDA                         ",false,null,6631009,null,"FULDA                         ","Fulda                         ","Fulda                         "]
["Fuldatal                      ","LK Kassel","06633009",71,"FULDATAL                      ",6633009,"ov",633,null,null,6631009,"06631009",null,null,null,633009,"ov","633","FULDATAL                      ",false,null,6633009,null,"FULDATAL                      ","Fuldatal                      ","Fuldatal                      "]
["Geisenheim                    ","LK Rheingau-Taunus","06439004",72,"GEISENHEIM                    ",6439004,"o",439,null,null,6633009,"06633009",null,null,null,439004,"o","439","GEISENHEIM                    ",false,null,6439004,null,"GEISENHEIM                    ","Geisenheim                    ","Geisenheim                    "]
["Gemuenden (Felda)             ","LK Vogelsberg","06535005",73,"GEMUENDEN (FELDA)             ",6535005,"l",535,null,null,6439004,"06439004",null,null,null,535005,"l","535","GEMUENDEN (FELDA)             ",false,null,6535005,null,"GEMUENDEN (FELDA)             ","Gemuenden (Felda)             ","Gemuenden (Felda)             "]
["Gemuenden (Wohra)             ","LK Waldeck-Frankenberg","06635012",74,"GEMUENDEN (WOHRA)             ",6635012,"l",635,null,null,6535005,"06535005",null,null,null,635012,"l","635","GEMUENDEN (WOHRA)             ",false,null,6635012,null,"GEMUENDEN (WOHRA)             ","Gemuenden (Wohra)             ","Gemuenden (Wohra)             "]
["Gersfeld (Rhoen)              ","LK Fulda","06631010",75,"GERSFELD (RHOEN)              ",6631010,"l",631,null,null,6635012,"06635012",null,null,null,631010,"l","631","GERSFELD (RHOEN)              ",false,null,6631010,null,"GERSFELD (RHOEN)              ","Gersfeld (Rhoen)              ","Gersfeld (Rhoen)              "]
["Giessen                       ","LK Gießen","06531005",76,"GIESSEN                       ",6531005,"ov",531,null,null,6631010,"06631010",null,null,null,531005,"ov","531","GIESSEN                       ",false,null,6531005,null,"GIESSEN                       ","Giessen                       ","Giessen                       "]
["Gilserberg                    ","LK Schwalm-Eder","06634006",77,"GILSERBERG                    ",6634006,"l",634,null,null,6531005,"06531005",null,null,null,634006,"l","634","GILSERBERG                    ",false,null,6634006,null,"GILSERBERG                    ","Gilserberg                    ","Gilserberg                    "]
["Gladenbach                    ","LK Marburg-Biedenkopf","06534010",78,"GLADENBACH                    ",6534010,"l",534,null,null,6634006,"06634006",null,null,null,534010,"l","534","GLADENBACH                    ",false,null,6534010,null,"GLADENBACH                    ","Gladenbach                    ","Gladenbach                    "]
["Glauburg                      ","LK Wetterau","06440010",79,"GLAUBURG                      ",6440010,"l",440,null,null,6534010,"06534010",null,null,null,440010,"l","440","GLAUBURG                      ",false,null,6440010,null,"GLAUBURG                      ","Glauburg                      ","Glauburg                      "]
["Gorxheimertal                 ","LK Bergstraße","06431008",80,"GORXHEIMERTAL                 ",6431008,"o",431,null,null,6440010,"06440010",null,null,null,431008,"o","431","GORXHEIMERTAL                 ",false,null,6431008,null,"GORXHEIMERTAL                 ","Gorxheimertal                 ","Gorxheimertal                 "]
["Grasellenbach                 ","LK Bergstraße","06431009",81,"GRASELLENBACH                 ",6431009,"o",431,null,null,6431008,"06431008",null,null,null,431009,"o","431","GRASELLENBACH                 ",false,null,6431009,null,"GRASELLENBACH                 ","Grasellenbach                 ","Grasellenbach                 "]
["Grebenau                      ","LK Vogelsberg","06535006",82,"GREBENAU                      ",6535006,"l",535,null,null,6431009,"06431009",null,null,null,535006,"l","535","GREBENAU                      ",false,null,6535006,null,"GREBENAU                      ","Grebenau                      ","Grebenau                      "]
["Grebenhain                    ","LK Vogelsberg","06535007",83,"GREBENHAIN                    ",6535007,"l",535,null,null,6535006,"06535006",null,null,null,535007,"l","535","GREBENHAIN                    ",false,null,6535007,null,"GREBENHAIN                    ","Grebenhain                    ","Grebenhain                    "]
["Grebenstein                   ","LK Kassel","06633010",84,"GREBENSTEIN                   ",6633010,"o",633,null,null,6535007,"06535007",null,null,null,633010,"o","633","GREBENSTEIN                   ",false,null,6633010,null,"GREBENSTEIN                   ","Grebenstein                   ","Grebenstein                   "]
["Griesheim                     ","LK Darmstadt-Dieburg","06432008",85,"GRIESHEIM                     ",6432008,"ov",432,null,null,6633010,"06633010",null,null,null,432008,"ov","432","GRIESHEIM                     ",false,null,6432008,null,"GRIESHEIM                     ","Griesheim                     ","Griesheim                     "]
["Grossalmerode, Stadt","LK Werra-Meißner","06636004",86,"GROSSALMERODE, STADT",6636004,null,null,null,null,6432008,"06432008",null,null,null,null,null,null,null,null,null,null,null,"GROSSALMERODE, STADT","Grossalmerode, Stadt","Grossalmerode, Stadt"]
["Grossenlueder                 ","LK Fulda","06631011",87,"GROSSENLUEDER                 ",6631011,"l",631,null,null,6636004,"06636004",null,null,null,631011,"l","631","GROSSENLUEDER                 ",{"$f":"EXACT(A87,S87)","v":false},null,6631011,null,"GROSSENLUEDER                 ","Grossenlueder                 ","Grossenlueder                 "]
["Grosskrotzenburg              ","LK Main-Kinzig","06435011",88,"GROSSKROTZENBURG              ",6435011,"ov",435,null,null,6631011,"06631011",null,null,null,435011,"ov","435","GROSSKROTZENBURG              ",false,null,6435011,null,"GROSSKROTZENBURG              ","Grosskrotzenburg              ","Grosskrotzenburg              "]
["Gross-Umstadt                 ","LK Darmstadt-Dieburg","06432010",89,"GROSS-UMSTADT                 ",6432010,"o",432,null,null,6435011,"06435011",null,null,null,432010,"o","432","GROSS-UMSTADT                 ",false,null,6432010,null,"GROSS-UMSTADT                 ","Gross-Umstadt                 ","Gross-Umstadt                 "]
["Gross-Zimmern                 ","LK Darmstadt-Dieburg","06432011",90,"GROSS-ZIMMERN                 ",6432011,"o",432,null,null,6432010,"06432010",null,null,null,432011,"o","432","GROSS-ZIMMERN                 ",false,null,6432011,null,"GROSS-ZIMMERN                 ","Gross-Zimmern                 ","Gross-Zimmern                 "]
["Gruenberg                     ","LK Gießen","06531006",91,"GRUENBERG                     ",6531006,"l",531,null,null,6432011,"06432011",null,null,null,531006,"l","531","GRUENBERG                     ",false,null,6531006,null,"GRUENBERG                     ","Gruenberg                     ","Gruenberg                     "]
["Gudensberg                    ","LK Schwalm-Eder","06634007",92,"GUDENSBERG                    ",6634007,"o",634,null,null,6531006,"06531006",null,null,null,634007,"o","634","GUDENSBERG                    ",false,null,6634007,null,"GUDENSBERG                    ","Gudensberg                    ","Gudensberg                    "]
["Habichtswald                  ","LK Kassel","06633011",93,"HABICHTSWALD                  ",6633011,"o",633,null,null,6634007,{"$f":"CONCATENATE($J$28,K93)","v":"06634007"},null,null,null,633011,"o","633","HABICHTSWALD                  ",false,null,6633011,null,"HABICHTSWALD                  ","Habichtswald                  ","Habichtswald                  "]
["Hadamar                       ","LK Limburg-Weilburg","06533007",94,"HADAMAR                       ",6533007,"l",533,null,null,6633011,"06633011",null,null,null,533007,"l","533","HADAMAR                       ",false,null,6533007,null,"HADAMAR                       ","Hadamar                       ","Hadamar                       "]
["Haina (Kloster)               ","LK Waldeck-Frankenberg","06635013",95,"HAINA (KLOSTER)               ",6635013,"l",635,null,null,6533007,"06533007",null,null,null,635013,"l","635","HAINA (KLOSTER)               ",false,null,6635013,null,"HAINA (KLOSTER)               ","Haina (Kloster)               ","Haina (Kloster)               "]
["Hainburg                      ","LK Offenbach","06438004",96,"HAINBURG                      ",6438004,"ov",438,null,null,6635013,"06635013",null,null,null,438004,"ov","438","HAINBURG                      ",false,null,6438004,null,"HAINBURG                      ","Hainburg                      ","Hainburg                      "]
["Hanau                         ","LK Main-Kinzig","06435014",97,"HANAU                         ",6435014,"ov",435,null,null,6438004,"06438004",null,null,null,435014,"ov","435","HANAU                         ",false,null,6435014,null,"HANAU                         ","Hanau                         ","Hanau                         "]
["Hattersheim Am Main           ","LK Main-Taunus","06436005",98,"HATTERSHEIM AM MAIN           ",6436005,"ov",436,null,null,6435014,"06435014",null,null,null,436005,"ov","436","HATTERSHEIM AM MAIN           ",false,null,6436005,null,"HATTERSHEIM AM MAIN           ","Hattersheim Am Main           ","Hattersheim Am Main           "]
["Hauneck                       ","LK Hersfeld-Rotenburg","06632007",99,"HAUNECK                       ",6632007,"l",632,null,null,6436005,"06436005",null,null,null,632007,"l","632","HAUNECK                       ",false,null,6632007,null,"HAUNECK                       ","Hauneck                       ","Hauneck                       "]
["Haunetal                      ","LK Hersfeld-Rotenburg","06632008",100,"HAUNETAL                      ",6632008,"l",632,null,null,6632007,"06632007",null,null,null,632008,"l","632","HAUNETAL                      ",false,null,6632008,null,"HAUNETAL                      ","Haunetal                      ","Haunetal                      "]
["Heidenrod                     ","LK Rheingau-Taunus","06439005",101,"HEIDENROD                     ",6439005,"o",439,null,null,6632008,"06632008",null,null,null,439005,"o","439","HEIDENROD                     ",false,null,6439005,null,"HEIDENROD                     ","Heidenrod                     ","Heidenrod                     "]
["Helsa                         ","LK Kassel","06633012",102,"HELSA                         ",6633012,"o",633,null,null,6439005,"06439005",null,null,null,633012,"o","633","HELSA                         ",false,null,6633012,null,"HELSA                         ","Helsa                         ","Helsa                         "]
["Herleshausen                  ","LK Werra-Meißner","06636005",103,"HERLESHAUSEN                  ",6636005,"l",636,null,null,6633012,"06633012",null,null,null,636005,"l","636","HERLESHAUSEN                  ",false,null,6636005,null,"HERLESHAUSEN                  ","Herleshausen                  ","Herleshausen                  "]
["Hessisch Lichtenau            ","LK Werra-Meißner","06636006",104,"HESSISCH LICHTENAU            ",6636006,"o",636,null,null,6437008,"06437008",null,null,null,636006,"o","636","HESSISCH LICHTENAU            ",false,null,6636006,null,"HESSISCH LICHTENAU            ","Hessisch Lichtenau            ","Hessisch Lichtenau            "]
["Hilders                       ","LK Fulda","06631012",105,"HILDERS                       ",6631012,"l",631,null,null,6636006,"06636006",null,null,null,631012,"l","631","HILDERS                       ",false,null,6631012,null,"HILDERS                       ","Hilders                       ","Hilders                       "]
["Hirzenhain                    ","LK Wetterau","06440011",106,"HIRZENHAIN                    ",6440011,"l",440,null,null,6631012,"06631012",null,null,null,440011,"l","440","HIRZENHAIN                    ",false,null,6440011,null,"HIRZENHAIN                    ","Hirzenhain                    ","Hirzenhain                    "]
["Hoechst Im Odenwald           ","LK Odenwaldkreis","06437009",107,"HOECHST IM ODENWALD           ",6437009,"l",437,null,null,6440011,"06440011",null,null,null,437009,"l","437","HOECHST IM ODENWALD           ",false,null,6437009,null,"HOECHST IM ODENWALD           ","Hoechst Im Odenwald           ","Hoechst Im Odenwald           "]
["Hofbieber                     ","LK Fulda","06631013",108,"HOFBIEBER                     ",6631013,"l",631,null,null,6437009,"06437009",null,null,null,631013,"l","631","HOFBIEBER                     ",false,null,6631013,null,"HOFBIEBER                     ","Hofbieber                     ","Hofbieber                     "]
["Hofgeismar                    ","LK Kassel","06633013",109,"HOFGEISMAR                    ",6633013,"o",633,null,null,6631013,"06631013",null,null,null,633013,"o","633","HOFGEISMAR                    ",false,null,6633013,null,"HOFGEISMAR                    ","Hofgeismar                    ","Hofgeismar                    "]
["Hohenahr                      ","LK Lahn-Dill","06532013",110,"HOHENAHR                      ",6532013,"l",532,null,null,6633013,"06633013",null,null,null,532013,"l","532","HOHENAHR                      ",false,null,6532013,null,"HOHENAHR                      ","Hohenahr                      ","Hohenahr                      "]
["Hohenroda                     ","LK Hersfeld-Rotenburg","06632010",111,"HOHENRODA                     ",6632010,"l",632,null,null,6532013,"06532013",null,null,null,632010,"l","632","HOHENRODA                     ",false,null,6632010,null,"HOHENRODA                     ","Hohenroda                     ","Hohenroda                     "]
["Homberg (Efze)                ","LK Schwalm-Eder","06634009",112,"HOMBERG (EFZE)                ",6634009,"l",634,null,null,6632010,"06632010",null,null,null,634009,"l","634","HOMBERG (EFZE)                ",false,null,6634009,null,"HOMBERG (EFZE)                ","Homberg (Efze)                ","Homberg (Efze)                "]
["Hosenfeld                     ","LK Fulda","06631014",113,"HOSENFELD                     ",6631014,"l",631,null,null,6634009,"06634009",null,null,null,631014,"l","631","HOSENFELD                     ",false,null,6631014,null,"HOSENFELD                     ","Hosenfeld                     ","Hosenfeld                     "]
["Huenfeld                      ","LK Fulda","06631015",114,"HUENFELD                      ",6631015,"l",631,null,null,6631014,"06631014",null,null,null,631015,"l","631","HUENFELD                      ",false,null,6631015,null,"HUENFELD                      ","Huenfeld                      ","Huenfeld                      "]
["Huenfelden                    ","LK Limburg-Weilburg","06533008",115,"HUENFELDEN                    ",6533008,"l",533,null,null,6631015,"06631015",null,null,null,533008,"l","533","HUENFELDEN                    ",false,null,6533008,null,"HUENFELDEN                    ","Huenfelden                    ","Huenfelden                    "]
["Huenstetten                   ","LK Rheingau-Taunus","06439007",116,"HUENSTETTEN                   ",6439007,"o",439,null,null,6533008,"06533008",null,null,null,439007,"o","439","HUENSTETTEN                   ",false,null,6439007,null,"HUENSTETTEN                   ","Huenstetten                   ","Huenstetten                   "]
["Hungen                        ","LK Gießen","06531008",117,"HUNGEN                        ",6531008,"l",531,null,null,6439007,"06439007",null,null,null,531008,"l","531","HUNGEN                        ",false,null,6531008,null,"HUNGEN                        ","Hungen                        ","Hungen                        "]
["Immenhausen                   ","LK Kassel","06633014",118,"IMMENHAUSEN                   ",6633014,"o",633,null,null,6531008,"06531008",null,null,null,633014,"o","633","IMMENHAUSEN                   ",{"$f":"EXACT(A118,S118)","v":false},null,6633014,null,"IMMENHAUSEN                   ","Immenhausen                   ","Immenhausen                   "]
["Jesberg                       ","LK Schwalm-Eder","06634010",119,"JESBERG                       ",6634010,"l",634,null,null,6633014,"06633014",null,null,null,634010,"l","634","JESBERG                       ",false,null,6634010,null,"JESBERG                       ","Jesberg                       ","Jesberg                       "]
["Jossgrund                     ","LK Main-Kinzig","06435016",120,"JOSSGRUND                     ",6435016,"l",435,null,null,6634010,"06634010",null,null,null,435016,"l","435","JOSSGRUND                     ",false,null,6435016,null,"JOSSGRUND                     ","Jossgrund                     ","Jossgrund                     "]
["Kalbach                       ","LK Fulda","06631016",121,"KALBACH                       ",6631016,"l",631,null,null,6435016,"06435016",null,null,null,631016,"l","631","KALBACH                       ",false,null,6631016,null,"KALBACH                       ","Kalbach                       ","Kalbach                       "]
["Kassel                        ","Kreisfreie Stadt","06611000",122,"KASSEL                        ",6611000,null,0,null,null,6631016,"06631016",null,null,null,611000,null,null,"KASSEL                        ",false,null,6611000,null,"KASSEL                        ","Kassel                        ","Kassel                        "]
["Kelkheim (Taunus)             ","LK Main-Taunus","06436008",123,"KELKHEIM (TAUNUS)             ",6436008,"ov",436,null,null,6611000,"06611000",null,null,null,436008,"ov","436","KELKHEIM (TAUNUS)             ",false,null,6436008,null,"KELKHEIM (TAUNUS)             ","Kelkheim (Taunus)             ","Kelkheim (Taunus)             "]
["Kirchhain                     ","LK Marburg-Biedenkopf","06534011",124,"KIRCHHAIN                     ",6534011,"l",534,null,null,6436008,"06436008",null,null,null,534011,"l","534","KIRCHHAIN                     ",false,null,6534011,null,"KIRCHHAIN                     ","Kirchhain                     ","Kirchhain                     "]
["Kirtorf                       ","LK Vogelsberg","06535010",125,"KIRTORF                       ",6535010,"l",535,null,null,6534011,"06534011",null,null,null,535010,"l","535","KIRTORF                       ",false,null,6535010,null,"KIRTORF                       ","Kirtorf                       ","Kirtorf                       "]
["Knuellwald                    ","LK Schwalm-Eder","06634011",126,"KNUELLWALD                    ",6634011,"l",634,null,null,6535010,"06535010",null,null,null,634011,"l","634","KNUELLWALD                    ",false,null,6634011,null,"KNUELLWALD                    ","Knuellwald                    ","Knuellwald                    "]
["Korbach                       ","LK Waldeck-Frankenberg","06635015",127,"KORBACH                       ",6635015,"l",635,null,null,6634011,"06634011",null,null,null,635015,"l","635","KORBACH                       ",false,null,6635015,null,"KORBACH                       ","Korbach                       ","Korbach                       "]
["Kreis Fulda","LK Fulda","06631000",128,"Kreis Fulda",6631000,null,0,null,null,6635015,"06635015",null,null,null,631000,null,null,"Kreis Fulda",true,null,6631000,null,"Kreis Fulda","Kreis Fulda","Kreis Fulda"]
["Kreis Gießen","LK Gießen","06531000",129,"Kreis Gießen",6531000,null,0,null,null,6631000,"06631000",null,null,null,531000,null,null,"Kreis Gießen",true,null,6531000,null,"Kreis Gießen",{"$f":"PROPER(X129)","v":"Kreis Gießen"},"Kreis Gießen"]
["Kreis Limburg-Weilburg","LK Limburg-Weilburg","06533000",130,"Kreis Limburg-Weilburg",6533000,null,0,null,null,6531000,"06531000",null,null,null,533000,null,null,"Kreis Limburg-Weilburg",true,null,6533000,null,"Kreis Limburg-Weilburg","Kreis Limburg-Weilburg","Kreis Limburg-Weilburg"]
["Kreis Waldeck-Frankenberg","LK Waldeck-Frankenberg","06635000",131,"Kreis Waldeck-Frankenberg",6635000,null,0,null,null,6533000,"06533000",null,null,null,635000,null,null,"Kreis Waldeck-Frankenberg",true,null,6635000,null,"Kreis Waldeck-Frankenberg","Kreis Waldeck-Frankenberg","Kreis Waldeck-Frankenberg"]
["Kuenzell                      ","LK Fulda","06631017",132,"KUENZELL                      ",6631017,"l",631,null,null,6635000,"06635000",null,null,null,631017,"l","631","KUENZELL                      ",false,null,6631017,null,"KUENZELL                      ","Kuenzell                      ","Kuenzell                      "]
["Lahntal                       ","LK Marburg-Biedenkopf","06534012",133,"LAHNTAL                       ",6534012,"l",534,null,null,6631017,"06631017",null,null,null,534012,"l","534","LAHNTAL                       ",false,null,6534012,null,"LAHNTAL                       ","Lahntal                       ","Lahntal                       "]
["Lampertheim                   ","LK Bergstraße","06431013",134,"LAMPERTHEIM                   ",6431013,"ov",431,null,null,6534012,"06534012",null,null,null,431013,"ov","431","LAMPERTHEIM                   ",false,null,6431013,null,"LAMPERTHEIM                   ","Lampertheim                   ","Lampertheim                   "]
["Langen                        ","LK Offenbach","06438006",135,"LANGEN                        ",6438006,"ov",438,null,null,6431013,"06431013",null,null,null,438006,"ov","438","LANGEN                        ",false,null,6438006,null,"LANGEN                        ","Langen                        ","Langen                        "]
["Laubach                       ","LK Gießen","06531010",136,"LAUBACH                       ",6531010,"l",531,null,null,6438006,"06438006",null,null,null,531010,"l","531","LAUBACH                       ",false,null,6531010,null,"LAUBACH                       ","Laubach                       ","Laubach                       "]
["Lauterbach (Hessen)           ","LK Vogelsberg","06535011",137,"LAUTERBACH (HESSEN)           ",6535011,"l",535,null,null,6531010,"06531010",null,null,null,535011,"l","535","LAUTERBACH (HESSEN)           ",false,null,6535011,null,"LAUTERBACH (HESSEN)           ","Lauterbach (Hessen)           ","Lauterbach (Hessen)           "]
["Lautertal (Vogelsberg)        ","LK Vogelsberg","06535012",138,"LAUTERTAL (VOGELSBERG)        ",6535012,"l",535,null,null,6535011,"06535011",null,null,null,535012,"l","535","LAUTERTAL (VOGELSBERG)        ",false,null,6535012,null,"LAUTERTAL (VOGELSBERG)        ","Lautertal (Vogelsberg)        ","Lautertal (Vogelsberg)        "]
["Leun                          ","LK Lahn-Dill","06532016",139,"LEUN                          ",6532016,"l",532,null,null,6535012,"06535012",null,null,null,532016,"l","532","LEUN                          ",false,null,6532016,null,"LEUN                          ","Leun                          ","Leun                          "]
["Lich                          ","LK Gießen","06531011",140,"LICH                          ",6531011,"l",531,null,null,6532016,"06532016",null,null,null,531011,"l","531","LICH                          ",false,null,6531011,null,"LICH                          ","Lich                          ","Lich                          "]
["Lichtenfels                   ","LK Waldeck-Frankenberg","06635016",141,"LICHTENFELS                   ",6635016,"l",635,null,null,6531011,"06531011",null,null,null,635016,"l","635","LICHTENFELS                   ",false,null,6635016,null,"LICHTENFELS                   ","Lichtenfels                   ","Lichtenfels                   "]
["Liebenau                      ","LK Kassel","06633016",142,"LIEBENAU                      ",6633016,"l",633,null,null,6635016,"06635016",null,null,null,633016,"l","633","LIEBENAU                      ",false,null,6633016,null,"LIEBENAU                      ","Liebenau                      ","Liebenau                      "]
["Lindenfels                    ","LK Bergstraße","06431015",143,"LINDENFELS                    ",6431015,"o",431,null,null,6633016,"06633016",null,null,null,431015,"o","431","LINDENFELS                    ",false,null,6431015,null,"LINDENFELS                    ","Lindenfels                    ","Lindenfels                    "]
["Loehnberg                     ","LK Limburg-Weilburg","06533010",144,"LOEHNBERG                     ",6533010,"l",533,null,null,6431015,"06431015",null,null,null,533010,"l","533","LOEHNBERG                     ",false,null,6533010,null,"LOEHNBERG                     ","Loehnberg                     ","Loehnberg                     "]
["Lollar                        ","LK Gießen","06531013",145,"LOLLAR                        ",6531013,"ov",531,null,null,6533010,"06533010",null,null,null,531013,"ov","531","LOLLAR                        ",false,null,6531013,null,"LOLLAR                        ","Lollar                        ","Lollar                        "]
["Lorch                         ","LK Rheingau-Taunus","06439010",146,"LORCH                         ",6439010,"o",439,null,null,6531013,"06531013",null,null,null,439010,"o","439","LORCH                         ",false,null,6439010,null,"LORCH                         ","Lorch                         ","Lorch                         "]
["Lorsch                        ","LK Bergstraße","06431016",147,"LORSCH                        ",6431016,"ov",431,null,null,6439010,"06439010",null,null,null,431016,"ov","431","LORSCH                        ",false,null,6431016,null,"LORSCH                        ","Lorsch                        ","Lorsch                        "]
["Ludwigsau                     ","LK Hersfeld-Rotenburg","06632012",148,"LUDWIGSAU                     ",6632012,"l",632,null,null,6431016,"06431016",null,null,null,632012,"l","632","LUDWIGSAU                     ",false,null,6632012,null,"LUDWIGSAU                     ","Ludwigsau                     ","Ludwigsau                     "]
["Luetzelbach                   ","LK Odenwaldkreis","06437010",149,"LUETZELBACH                   ",6437010,"l",437,null,null,6632012,"06632012",null,null,null,437010,"l","437","LUETZELBACH                   ",false,null,6437010,null,"LUETZELBACH                   ","Luetzelbach                   ","Luetzelbach                   "]
["Mainhausen                    ","LK Offenbach","06438007",150,"MAINHAUSEN                    ",6438007,"ov",438,null,null,6437010,"06437010",null,null,null,438007,"ov","438","MAINHAUSEN                    ",{"$f":"EXACT(A150,S150)","v":false},null,6438007,null,"MAINHAUSEN                    ","Mainhausen                    ","Mainhausen                    "]
["Maintal                       ","LK Main-Kinzig","06435019",151,"MAINTAL                       ",6435019,"ov",435,null,null,6438007,"06438007",null,null,null,435019,"ov","435","MAINTAL                       ",false,null,6435019,null,"MAINTAL                       ","Maintal                       ","Maintal                       "]
["Meinhard                      ","LK Werra-Meißner","06636007",152,"MEINHARD                      ",6636007,"l",636,null,null,6435019,"06435019",null,null,null,636007,"l","636","MEINHARD                      ",false,null,6636007,null,"MEINHARD                      ","Meinhard                      ","Meinhard                      "]
["Meissner                      ","LK Werra-Meißner","06636008",153,"MEISSNER                      ",6636008,"l",636,null,null,6636007,"06636007",null,null,null,636008,"l","636","MEISSNER                      ",false,null,6636008,null,"MEISSNER                      ","Meissner                      ","Meissner                      "]
["Mengerskirchen                ","LK Limburg-Weilburg","06533011",154,"MENGERSKIRCHEN                ",6533011,"l",533,null,null,6636008,"06636008",null,null,null,533011,"l","533","MENGERSKIRCHEN                ",false,null,6533011,null,"MENGERSKIRCHEN                ","Mengerskirchen                ","Mengerskirchen                "]
["Michelstadt                   ","LK Odenwaldkreis","06437011",155,"MICHELSTADT                   ",6437011,"l",437,null,null,6533011,"06533011",null,null,null,437011,"l","437","MICHELSTADT                   ",false,null,6437011,null,"MICHELSTADT                   ","Michelstadt                   ","Michelstadt                   "]
["Moerlenbach                   ","LK Bergstraße","06431017",156,"MOERLENBACH                   ",6431017,"o",431,null,null,6437011,{"$f":"CONCATENATE($J$28,K156)","v":"06437011"},null,null,null,431017,"o","431","MOERLENBACH                   ",false,null,6431017,null,"MOERLENBACH                   ","Moerlenbach                   ","Moerlenbach                   "]
["Morschen                      ","LK Schwalm-Eder","06634015",157,"MORSCHEN                      ",6634015,"l",634,null,null,6431017,"06431017",null,null,null,634015,"l","634","MORSCHEN                      ",false,null,6634015,null,"MORSCHEN                      ","Morschen                      ","Morschen                      "]
["Muecke","LK Vogelsberg","06535013",158,"MUECKE",6535013,null,null,null,null,6634015,"06634015",null,null,null,null,null,null,null,null,null,null,null,"MUECKE","Muecke","Muecke"]
["Muehlheim Am Main             ","LK Offenbach","06438008",159,"MUEHLHEIM AM MAIN             ",6438008,"ov",438,null,null,6535013,"06535013",null,null,null,438008,"ov","438","MUEHLHEIM AM MAIN             ",{"$f":"EXACT(A159,S159)","v":false},null,6438008,null,"MUEHLHEIM AM MAIN             ","Muehlheim Am Main             ","Muehlheim Am Main             "]
["Muenchhausen                  ","LK Marburg-Biedenkopf","06534015",160,"MUENCHHAUSEN                  ",6534015,"l",534,null,null,6438008,"06438008",null,null,null,534015,"l","534","MUENCHHAUSEN                  ",false,null,6534015,null,"MUENCHHAUSEN                  ","Muenchhausen                  ","Muenchhausen                  "]
["Muenster                      ","LK Darmstadt-Dieburg","06432015",161,"MUENSTER                      ",6432015,"o",432,null,null,6534015,"06534015",null,null,null,432015,"o","432","MUENSTER                      ",false,null,6432015,null,"MUENSTER                      ","Muenster                      ","Muenster                      "]
["Naumburg                      ","LK Kassel","06633018",162,"NAUMBURG                      ",6633018,"o",633,null,null,6432015,"06432015",null,null,null,633018,"o","633","NAUMBURG                      ",false,null,6633018,null,"NAUMBURG                      ","Naumburg                      ","Naumburg                      "]
["Nentershausen                 ","LK Hersfeld-Rotenburg","06632013",163,"NENTERSHAUSEN                 ",6632013,"l",632,null,null,6633018,"06633018",null,null,null,632013,"l","632","NENTERSHAUSEN                 ",false,null,6632013,null,"NENTERSHAUSEN                 ","Nentershausen                 ","Nentershausen                 "]
["Neu-Eichenberg                ","LK Werra-Meißner","06636009",164,"NEU-EICHENBERG                ",6636009,"l",636,null,null,6632013,"06632013",null,null,null,636009,"l","636","NEU-EICHENBERG                ",false,null,6636009,null,"NEU-EICHENBERG                ","Neu-Eichenberg                ","Neu-Eichenberg                "]
["Neuental                      ","LK Schwalm-Eder","06634016",165,"NEUENTAL                      ",6634016,"l",634,null,null,6636009,"06636009",null,null,null,634016,"l","634","NEUENTAL                      ",false,null,6634016,null,"NEUENTAL                      ","Neuental                      ","Neuental                      "]
["Neukirchen                    ","LK Schwalm-Eder","06634017",166,"NEUKIRCHEN                    ",6634017,"l",634,null,null,6634016,"06634016",null,null,null,634017,"l","634","NEUKIRCHEN                    ",false,null,6634017,null,"NEUKIRCHEN                    ","Neukirchen                    ","Neukirchen                    "]
["Neustadt (Hessen)             ","LK Marburg-Biedenkopf","06534016",167,"NEUSTADT (HESSEN)             ",6534016,"l",534,null,null,6634017,"06634017",null,null,null,534016,"l","534","NEUSTADT (HESSEN)             ",false,null,6534016,null,"NEUSTADT (HESSEN)             ","Neustadt (Hessen)             ","Neustadt (Hessen)             "]
["Nidda                         ","LK Wetterau","06440016",168,"NIDDA                         ",6440016,"l",440,null,null,6534016,"06534016",null,null,null,440016,"l","440","NIDDA                         ",false,null,6440016,null,"NIDDA                         ","Nidda                         ","Nidda                         "]
["Niddatal                      ","LK Wetterau","06440017",169,"NIDDATAL                      ",6440017,"o",440,null,null,6440016,"06440016",null,null,null,440017,"o","440","NIDDATAL                      ",false,null,6440017,null,"NIDDATAL                      ","Niddatal                      ","Niddatal                      "]
["Niedenstein                   ","LK Schwalm-Eder","06634018",170,"NIEDENSTEIN                   ",6634018,"o",634,null,null,6440017,"06440017",null,null,null,634018,"o","634","NIEDENSTEIN                   ",false,null,6634018,null,"NIEDENSTEIN                   ","Niedenstein                   ","Niedenstein                   "]
["Nieste                        ","LK Kassel","06633019",171,"NIESTE                        ",6633019,"o",633,null,null,6634018,"06634018",null,null,null,633019,"o","633","NIESTE                        ",false,null,6633019,null,"NIESTE                        ","Nieste                        ","Nieste                        "]
["Nuesttal                      ","LK Fulda","06631019",172,"NUESTTAL                      ",6631019,"l",631,null,null,6633019,"06633019",null,null,null,631019,"l","631","NUESTTAL                      ",false,null,6631019,null,"NUESTTAL                      ","Nuesttal                      ","Nuesttal                      "]
["Oberaula                      ","LK Schwalm-Eder","06634019",173,"OBERAULA                      ",6634019,"l",634,null,null,6631019,"06631019",null,null,null,634019,"l","634","OBERAULA                      ",false,null,6634019,null,"OBERAULA                      ","Oberaula                      ","Oberaula                      "]
["Obertshausen                  ","LK Offenbach","06438010",174,"OBERTSHAUSEN                  ",6438010,"ov",438,null,null,6634019,"06634019",null,null,null,438010,"ov","438","OBERTSHAUSEN                  ",false,null,6438010,null,"OBERTSHAUSEN                  ","Obertshausen                  ","Obertshausen                  "]
["Oberzent","LK Odenwaldkreis",6437016,175,"OBERZENT",6437016]
["Odenwaldkreis","LK Odenwaldkreis","06437000",176,"Odenwaldkreis",6437000,null,0,null,null,6633021,"06633021",null,null,null,437000,null,null,"Odenwaldkreis",true,null,6437000,null,"Odenwaldkreis","Odenwaldkreis","Odenwaldkreis"]
["Oestrich-Winkel, Stadt","LK Rheingau-Taunus","06439012",177,"OESTRICH-WINKEL, STADT",6439012,null,null,null,null,6437000,"06437000",null,null,null,null,null,null,null,null,null,null,null,"OESTRICH-WINKEL, STADT","Oestrich-Winkel, Stadt","Oestrich-Winkel, Stadt"]
["Offenbach Am Main             ","Kreisfreie Stadt","06413000",178,"OFFENBACH AM MAIN             ",6413000,null,0,null,null,6439012,"06439012",null,null,null,413000,null,null,"OFFENBACH AM MAIN             ",{"$f":"EXACT(A178,S178)","v":false},null,6413000,null,"OFFENBACH AM MAIN             ","Offenbach Am Main             ","Offenbach Am Main             "]
["Ortenberg                     ","LK Wetterau","06440019",179,"ORTENBERG                     ",6440019,"l",440,null,null,6413000,"06413000",null,null,null,440019,"l","440","ORTENBERG                     ",false,null,6440019,null,"ORTENBERG                     ","Ortenberg                     ","Ortenberg                     "]
["Ottrau                        ","LK Schwalm-Eder","06634020",180,"OTTRAU                        ",6634020,"l",634,null,null,6440019,"06440019",null,null,null,634020,"l","634","OTTRAU                        ",false,null,6634020,null,"OTTRAU                        ","Ottrau                        ","Ottrau                        "]
["Pfungstadt                    ","LK Darmstadt-Dieburg","06432018",181,"PFUNGSTADT                    ",6432018,"ov",432,null,null,6634020,"06634020",null,null,null,432018,"ov","432","PFUNGSTADT                    ",false,null,6432018,null,"PFUNGSTADT                    ","Pfungstadt                    ","Pfungstadt                    "]
["Pohlheim                      ","LK Gießen","06531014",182,"POHLHEIM                      ",6531014,"o",531,null,null,6432018,"06432018",null,null,null,531014,"o","531","POHLHEIM                      ",false,null,6531014,null,"POHLHEIM                      ","Pohlheim                      ","Pohlheim                      "]
["Poppenhausen (Wasserkuppe)    ","LK Fulda","06631021",183,"POPPENHAUSEN (WASSERKUPPE)    ",6631021,"l",631,null,null,6531014,"06531014",null,null,null,631021,"l","631","POPPENHAUSEN (WASSERKUPPE)    ",false,null,6631021,null,"POPPENHAUSEN (WASSERKUPPE)    ","Poppenhausen (Wasserkuppe)    ","Poppenhausen (Wasserkuppe)    "]
["Rabenau                       ","LK Gießen","06531015",184,"RABENAU                       ",6531015,"l",531,null,null,6631021,"06631021",null,null,null,531015,"l","531","RABENAU                       ",false,null,6531015,null,"RABENAU                       ","Rabenau                       ","Rabenau                       "]
["Rauschenberg                  ","LK Marburg-Biedenkopf","06534017",185,"RAUSCHENBERG                  ",6534017,"l",534,null,null,6531015,"06531015",null,null,null,534017,"l","534","RAUSCHENBERG                  ",false,null,6534017,null,"RAUSCHENBERG                  ","Rauschenberg                  ","Rauschenberg                  "]
["Reichelsheim (Odenwald)       ","LK Odenwaldkreis","06437013",186,"REICHELSHEIM (ODENWALD)       ",6437013,"l",437,null,null,6534017,"06534017",null,null,null,437013,"l","437","REICHELSHEIM (ODENWALD)       ",false,null,6437013,null,"REICHELSHEIM (ODENWALD)       ","Reichelsheim (Odenwald)       ","Reichelsheim (Odenwald)       "]
["Reinhardshagen                ","LK Kassel","06633022",187,"REINHARDSHAGEN                ",6633022,"o",633,null,null,6437013,"06437013",null,null,null,633022,"o","633","REINHARDSHAGEN                ",false,null,6633022,null,"REINHARDSHAGEN                ","Reinhardshagen                ","Reinhardshagen                "]
["Riedstadt                     ","LK Groß-Gerau","06433011",188,"RIEDSTADT                     ",6433011,"o",433,null,null,6633022,"06633022",null,null,null,433011,"o","433","RIEDSTADT                     ",false,null,6433011,null,"RIEDSTADT                     ","Riedstadt                     ","Riedstadt                     "]
["Ringgau                       ","LK Werra-Meißner","06636010",189,"RINGGAU                       ",6636010,"l",636,null,null,6433011,"06433011",null,null,null,636010,"l","636","RINGGAU                       ",false,null,6636010,null,"RINGGAU                       ","Ringgau                       ","Ringgau                       "]
["Rodgau                        ","LK Offenbach","06438011",190,"RODGAU                        ",6438011,"ov",438,null,null,6636010,"06636010",null,null,null,438011,"ov","438","RODGAU                        ",false,null,6438011,null,"RODGAU                        ","Rodgau                        ","Rodgau                        "]
["Roedermark                    ","LK Offenbach","06438012",191,"ROEDERMARK                    ",6438012,"ov",438,null,null,6438011,"06438011",null,null,null,438012,"ov","438","ROEDERMARK                    ",false,null,6438012,null,"ROEDERMARK                    ","Roedermark                    ","Roedermark                    "]
["Romrod                        ","LK Vogelsberg","06535014",192,"ROMROD                        ",6535014,"l",535,null,null,6438012,"06438012",null,null,null,535014,"l","535","ROMROD                        ",false,null,6535014,null,"ROMROD                        ","Romrod                        ","Romrod                        "]
["Ronshausen                    ","LK Hersfeld-Rotenburg","06632017",193,"RONSHAUSEN                    ",6632017,"l",632,null,null,6535014,"06535014",null,null,null,632017,"l","632","RONSHAUSEN                    ",false,null,6632017,null,"RONSHAUSEN                    ",{"$f":"PROPER(X193)","v":"Ronshausen                    "},"Ronshausen                    "]
["Rosenthal                     ","LK Waldeck-Frankenberg","06635017",194,"ROSENTHAL                     ",6635017,"l",635,null,null,6632017,"06632017",null,null,null,635017,"l","635","ROSENTHAL                     ",false,null,6635017,null,"ROSENTHAL                     ","Rosenthal                     ","Rosenthal                     "]
["Rotenburg A.D.Fulda           ","LK Hersfeld-Rotenburg","06632018",195,"ROTENBURG A.D.FULDA           ",6632018,"l",632,null,null,6635017,"06635017",null,null,null,632018,"l","632","ROTENBURG A.D.FULDA           ",false,null,6632018,null,"ROTENBURG A.D.FULDA           ","Rotenburg A.D.Fulda           ","Rotenburg A.D.Fulda           "]
["Ruedesheim Am Rhein           ","LK Rheingau-Taunus","06439013",196,"RUEDESHEIM AM RHEIN           ",6439013,"o",439,null,null,6437014,"06437014",null,null,null,439013,"o","439","RUEDESHEIM AM RHEIN           ",false,null,6439013,null,"RUEDESHEIM AM RHEIN           ","Ruedesheim Am Rhein           ","Ruedesheim Am Rhein           "]
["Ruesselsheim                  ","LK Groß-Gerau","06433012",197,"RUESSELSHEIM                  ",6433012,"ov",433,null,null,6439013,"06439013",null,null,null,433012,"ov","433","RUESSELSHEIM                  ",false,null,6433012,null,"RUESSELSHEIM                  ","Ruesselsheim                  ","Ruesselsheim                  "]
["Schaafheim                    ","LK Darmstadt-Dieburg","06432021",198,"SCHAAFHEIM                    ",6432021,"o",432,null,null,6433012,"06433012",null,null,null,432021,"o","432","SCHAAFHEIM                    ",false,null,6432021,null,"SCHAAFHEIM                    ","Schaafheim                    ","Schaafheim                    "]
["Schauenburg                   ","LK Kassel","06633023",199,"SCHAUENBURG                   ",6633023,"ov",633,null,null,6432021,"06432021",null,null,null,633023,"ov","633","SCHAUENBURG                   ",false,null,6633023,null,"SCHAUENBURG                   ","Schauenburg                   ","Schauenburg                   "]
["Schenklengsfeld               ","LK Hersfeld-Rotenburg","06632019",200,"SCHENKLENGSFELD               ",6632019,"l",632,null,null,6633023,"06633023",null,null,null,632019,"l","632","SCHENKLENGSFELD               ",false,null,6632019,null,"SCHENKLENGSFELD               ","Schenklengsfeld               ","Schenklengsfeld               "]
["Schlitz                       ","LK Vogelsberg","06535015",201,"SCHLITZ                       ",6535015,"l",535,null,null,6632019,"06632019",null,null,null,535015,"l","535","SCHLITZ                       ",false,null,6535015,null,"SCHLITZ                       ","Schlitz                       ","Schlitz                       "]
["Schluechtern                  ","LK Main-Kinzig","06435025",202,"SCHLUECHTERN                  ",6435025,"l",435,null,null,6535015,"06535015",null,null,null,435025,"l","435","SCHLUECHTERN                  ",false,null,6435025,null,"SCHLUECHTERN                  ","Schluechtern                  ","Schluechtern                  "]
["Schoeffengrund                ","LK Lahn-Dill","06532018",203,"SCHOEFFENGRUND                ",6532018,"l",532,null,null,6435025,"06435025",null,null,null,532018,"l","532","SCHOEFFENGRUND                ",false,null,6532018,null,"SCHOEFFENGRUND                ","Schoeffengrund                ","Schoeffengrund                "]
["Schotten                      ","LK Vogelsberg","06535016",204,"SCHOTTEN                      ",6535016,"l",535,null,null,6532018,"06532018",null,null,null,535016,"l","535","SCHOTTEN                      ",false,null,6535016,null,"SCHOTTEN                      ","Schotten                      ","Schotten                      "]
["Schrecksbach                  ","LK Schwalm-Eder","06634021",205,"SCHRECKSBACH                  ",6634021,"l",634,null,null,6535016,"06535016",null,null,null,634021,"l","634","SCHRECKSBACH                  ",false,null,6634021,null,"SCHRECKSBACH                  ","Schrecksbach                  ","Schrecksbach                  "]
["Schwalm-Eder-Kreis","LK Schwalm-Eder","06634000",206,"Schwalm-Eder-Kreis",6634000,null,0,null,null,6634021,"06634021",null,null,null,634000,null,null,"Schwalm-Eder-Kreis",true,null,6634000,null,"Schwalm-Eder-Kreis","Schwalm-Eder-Kreis","Schwalm-Eder-Kreis"]
["Schwalmstadt                  ","LK Schwalm-Eder","06634022",207,"SCHWALMSTADT                  ",6634022,"l",634,null,null,6634000,"06634000",null,null,null,634022,"l","634","SCHWALMSTADT                  ",false,null,6634022,null,"SCHWALMSTADT                  ","Schwalmstadt                  ","Schwalmstadt                  "]
["Schwalmtal                    ","LK Vogelsberg","06535017",208,"SCHWALMTAL                    ",6535017,"l",535,null,null,6634022,"06634022",null,null,null,535017,"l","535","SCHWALMTAL                    ",false,null,6535017,null,"SCHWALMTAL                    ","Schwalmtal                    ","Schwalmtal                    "]
["Schwarzenborn                 ","LK Schwalm-Eder","06634023",209,"SCHWARZENBORN                 ",6634023,"l",634,null,null,6535017,"06535017",null,null,null,634023,"l","634","SCHWARZENBORN                 ",{"$f":"EXACT(A209,S209)","v":false},null,6634023,null,"SCHWARZENBORN                 ","Schwarzenborn                 ","Schwarzenborn                 "]
["Selters (Taunus)              ","LK Limburg-Weilburg","06533014",210,"SELTERS (TAUNUS)              ",6533014,"o",533,null,null,6634023,"06634023",null,null,null,533014,"o","533","SELTERS (TAUNUS)              ",false,null,6533014,null,"SELTERS (TAUNUS)              ","Selters (Taunus)              ","Selters (Taunus)              "]
["Siegbach                      ","LK Lahn-Dill","06532019",211,"SIEGBACH                      ",6532019,"l",532,null,null,6437015,"06437015",null,null,null,532019,"l","532","SIEGBACH                      ",false,null,6532019,null,"SIEGBACH                      ","Siegbach                      ","Siegbach                      "]
["Sinntal                       ","LK Main-Kinzig","06435027",212,"SINNTAL                       ",6435027,"l",435,null,null,6532019,"06532019",null,null,null,435027,"l","435","SINNTAL                       ",false,null,6435027,null,"SINNTAL                       ","Sinntal                       ","Sinntal                       "]
["Soehrewald                    ","LK Kassel","06633024",213,"SOEHREWALD                    ",6633024,"o",633,null,null,6435027,"06435027",null,null,null,633024,"o","633","SOEHREWALD                    ",false,null,6633024,null,"SOEHREWALD                    ","Soehrewald                    ","Soehrewald                    "]
["Sontra                        ","LK Werra-Meißner","06636011",214,"SONTRA                        ",6636011,"l",636,null,null,6633024,"06633024",null,null,null,636011,"l","636","SONTRA                        ",false,null,6636011,null,"SONTRA                        ","Sontra                        ","Sontra                        "]
["Staufenberg                   ","LK Gießen","06531017",215,"STAUFENBERG                   ",6531017,"o",531,null,null,6636011,"06636011",null,null,null,531017,"o","531","STAUFENBERG                   ",false,null,6531017,null,"STAUFENBERG                   ","Staufenberg                   ","Staufenberg                   "]
["Steinau An Der Strasse        ","LK Main-Kinzig","06435028",216,"STEINAU AN DER STRASSE        ",6435028,"l",435,null,null,6531017,"06531017",null,null,null,435028,"l","435","STEINAU AN DER STRASSE        ",false,null,6435028,null,"STEINAU AN DER STRASSE        ","Steinau An Der Strasse        ","Steinau An Der Strasse        "]
["Tann (Rhoen)                  ","LK Fulda","06631023",217,"TANN (RHOEN)                  ",6631023,"l",631,null,null,6435028,"06435028",null,null,null,631023,"l","631","TANN (RHOEN)                  ",false,null,6631023,null,"TANN (RHOEN)                  ","Tann (Rhoen)                  ","Tann (Rhoen)                  "]
["Trendelburg                   ","LK Kassel","06633025",218,"TRENDELBURG                   ",6633025,"l",633,null,null,6631023,{"$f":"CONCATENATE($J$28,K218)","v":"06631023"},null,null,null,633025,"l","633","TRENDELBURG                   ",false,null,6633025,null,"TRENDELBURG                   ","Trendelburg                   ","Trendelburg                   "]
["Twistetal                     ","LK Waldeck-Frankenberg","06635018",219,"TWISTETAL                     ",6635018,"l",635,null,null,6633025,"06633025",null,null,null,635018,"l","635","TWISTETAL                     ",false,null,6635018,null,"TWISTETAL                     ","Twistetal                     ","Twistetal                     "]
["Usingen                       ","LK Hochtaunus","06434011",220,"USINGEN                       ",6434011,"o",434,null,null,6635018,"06635018",null,null,null,434011,"o","434","USINGEN                       ",false,null,6434011,null,"USINGEN                       ","Usingen                       ","Usingen                       "]
["Vellmar                       ","LK Kassel","06633026",221,"VELLMAR                       ",6633026,"ov",633,null,null,6434011,"06434011",null,null,null,633026,"ov","633","VELLMAR                       ",false,null,6633026,null,"VELLMAR                       ","Vellmar                       ","Vellmar                       "]
["Viernheim                     ","LK Bergstraße","06431020",222,"VIERNHEIM                     ",6431020,"ov",431,null,null,6633026,"06633026",null,null,null,431020,"ov","431","VIERNHEIM                     ",false,null,6431020,null,"VIERNHEIM                     ","Viernheim                     ","Viernheim                     "]
["Villmar                       ","LK Limburg-Weilburg","06533015",223,"VILLMAR                       ",6533015,"l",533,null,null,6431020,"06431020",null,null,null,533015,"l","533","VILLMAR                       ",false,null,6533015,null,"VILLMAR                       ","Villmar                       ","Villmar                       "]
["Voehl                         ","LK Waldeck-Frankenberg","06635019",224,"VOEHL                         ",6635019,"l",635,null,null,6533015,"06533015",null,null,null,635019,"l","635","VOEHL                         ",false,null,6635019,null,"VOEHL                         ","Voehl                         ","Voehl                         "]
["Vogelsbergkreis","LK Vogelsberg","06535000",225,"Vogelsbergkreis",6535000,null,0,null,null,6635019,"06635019",null,null,null,535000,null,null,"Vogelsbergkreis",true,null,6535000,null,"Vogelsbergkreis","Vogelsbergkreis","Vogelsbergkreis"]
["Wabern                        ","LK Schwalm-Eder","06634025",226,"WABERN                        ",6634025,"o",634,null,null,6535000,"06535000",null,null,null,634025,"o","634","WABERN                        ",false,null,6634025,null,"WABERN                        ","Wabern                        ","Wabern                        "]
["Waechtersbach                 ","LK Main-Kinzig","06435029",227,"WAECHTERSBACH                 ",6435029,"l",435,null,null,6634025,"06634025",null,null,null,435029,"l","435","WAECHTERSBACH                 ",false,null,6435029,null,"WAECHTERSBACH                 ","Waechtersbach                 ","Waechtersbach                 "]
["Waldbrunn (Westerwald)        ","LK Limburg-Weilburg","06533016",228,"WALDBRUNN (WESTERWALD)        ",6533016,"l",533,null,null,6633027,"06633027",null,null,null,533016,"l","533","WALDBRUNN (WESTERWALD)        ",false,null,6533016,null,"WALDBRUNN (WESTERWALD)        ","Waldbrunn (Westerwald)        ","Waldbrunn (Westerwald)        "]
["Waldeck                       ","LK Waldeck-Frankenberg","06635021",229,"WALDECK                       ",6635021,"l",635,null,null,6533016,"06533016",null,null,null,635021,"l","635","WALDECK                       ",false,null,6635021,null,"WALDECK                       ","Waldeck                       ","Waldeck                       "]
["Waldkappel                    ","LK Werra-Meißner","06636012",230,"WALDKAPPEL                    ",6636012,"l",636,null,null,6635021,"06635021",null,null,null,636012,"l","636","WALDKAPPEL                    ",false,null,6636012,null,"WALDKAPPEL                    ","Waldkappel                    ","Waldkappel                    "]
["Wald-Michelbach               ","LK Bergstraße","06431021",231,"WALD-MICHELBACH               ",6431021,"o",431,null,null,6636012,"06636012",null,null,null,431021,"o","431","WALD-MICHELBACH               ",false,null,6431021,null,"WALD-MICHELBACH               ","Wald-Michelbach               ","Wald-Michelbach               "]
["Waldsolms                     ","LK Lahn-Dill","06532022",232,"WALDSOLMS                     ",6532022,"l",532,null,null,6431021,"06431021",null,null,null,532022,"l","532","WALDSOLMS                     ",false,null,6532022,null,"WALDSOLMS                     ","Waldsolms                     ","Waldsolms                     "]
["Wanfried                      ","LK Werra-Meißner","06636013",233,"WANFRIED                      ",6636013,"l",636,null,null,6532022,"06532022",null,null,null,636013,"l","636","WANFRIED                      ",false,null,6636013,null,"WANFRIED                      ","Wanfried                      ","Wanfried                      "]
["Wehretal                      ","LK Werra-Meißner","06636014",234,"WEHRETAL                      ",6636014,"l",636,null,null,6636013,"06636013",null,null,null,636014,"l","636","WEHRETAL                      ",false,null,6636014,null,"WEHRETAL                      ","Wehretal                      ","Wehretal                      "]
["Weilburg                      ","LK Limburg-Weilburg","06533017",235,"WEILBURG                      ",6533017,"l",533,null,null,6636014,"06636014",null,null,null,533017,"l","533","WEILBURG                      ",false,null,6533017,null,"WEILBURG                      ","Weilburg                      ","Weilburg                      "]
["Weilmuenster                  ","LK Limburg-Weilburg","06533018",236,"WEILMUENSTER                  ",6533018,"l",533,null,null,6533017,"06533017",null,null,null,533018,"l","533","WEILMUENSTER                  ",false,null,6533018,null,"WEILMUENSTER                  ","Weilmuenster                  ","Weilmuenster                  "]
["Weinbach                      ","LK Limburg-Weilburg","06533019",237,"WEINBACH                      ",6533019,"l",533,null,null,6533018,"06533018",null,null,null,533019,"l","533","WEINBACH                      ",false,null,6533019,null,"WEINBACH                      ","Weinbach                      ","Weinbach                      "]
["Weissenborn                   ","LK Werra-Meißner","06636015",238,"WEISSENBORN                   ",6636015,"l",636,null,null,6533019,"06533019",null,null,null,636015,"l","636","WEISSENBORN                   ",false,null,6636015,null,"WEISSENBORN                   ","Weissenborn                   ","Weissenborn                   "]
["Werra-Meißner-Kreis","LK Werra-Meißner","06636000",239,"Werra-Meißner-Kreis",6636000,null,0,null,null,6636015,"06636015",null,null,null,636000,null,null,"Werra-Meißner-Kreis",{"$f":"EXACT(A239,S239)","v":true},null,6636000,null,"Werra-Meißner-Kreis","Werra-Meißner-Kreis","Werra-Meißner-Kreis"]
["Wesertal","LK Kassel",6633030,240,"WESERTAL",6633030]
["Wetter (Hessen)               ","LK Marburg-Biedenkopf","06534021",241,"WETTER (HESSEN)               ",6534021,"l",534,null,null,6636000,"06636000",null,null,null,534021,"l","534","WETTER (HESSEN)               ",false,null,6534021,null,"WETTER (HESSEN)               ","Wetter (Hessen)               ","Wetter (Hessen)               "]
["Wetzlar                       ","LK Lahn-Dill","06532023",242,"WETZLAR                       ",6532023,"ov",532,null,null,6534021,"06534021",null,null,null,532023,"ov","532","WETZLAR                       ",false,null,6532023,null,"WETZLAR                       ","Wetzlar                       ","Wetzlar                       "]
["Wildeck                       ","LK Hersfeld-Rotenburg","06632020",243,"WILDECK                       ",6632020,"l",632,null,null,6532023,"06532023",null,null,null,632020,"l","632","WILDECK                       ",false,null,6632020,null,"WILDECK                       ","Wildeck                       ","Wildeck                       "]
["Willingshausen                ","LK Schwalm-Eder","06634026",244,"WILLINGSHAUSEN                ",6634026,"l",634,null,null,6632020,"06632020",null,null,null,634026,"l","634","WILLINGSHAUSEN                ",false,null,6634026,null,"WILLINGSHAUSEN                ","Willingshausen                ","Willingshausen                "]
["Witzenhausen                  ","LK Werra-Meißner","06636016",245,"WITZENHAUSEN                  ",6636016,"l",636,null,null,6634026,"06634026",null,null,null,636016,"l","636","WITZENHAUSEN                  ",false,null,6636016,null,"WITZENHAUSEN                  ","Witzenhausen                  ","Witzenhausen                  "]
["Woelfersheim                  ","LK Wetterau","06440024",246,"WOELFERSHEIM                  ",6440024,"o",440,null,null,6636016,"06636016",null,null,null,440024,"o","440","WOELFERSHEIM                  ",false,null,6440024,null,"WOELFERSHEIM                  ","Woelfersheim                  ","Woelfersheim                  "]
["Wohratal                      ","LK Marburg-Biedenkopf","06534022",247,"WOHRATAL                      ",6534022,"l",534,null,null,6440024,"06440024",null,null,null,534022,"l","534","WOHRATAL                      ",false,null,6534022,null,"WOHRATAL                      ","Wohratal                      ","Wohratal                      "]
["Wolfhagen                     ","LK Kassel","06633028",248,"WOLFHAGEN                     ",6633028,"o",633,null,null,6534022,"06534022",null,null,null,633028,"o","633","WOLFHAGEN                     ",false,null,6633028,null,"WOLFHAGEN                     ","Wolfhagen                     ","Wolfhagen                     "]
["Zierenberg                    ","LK Kassel","06633029",249,"ZIERENBERG                    ",6633029,"o",633,null,null,6633028,"06633028",null,null,null,633029,"o","633","ZIERENBERG                    ",false,null,6633029,null,"ZIERENBERG                    ","Zierenberg                    ","Zierenberg                    "]
[null,null,null,null,null,null,null,0,null,null,6633029,"06633029"]
[null,null,null,null,null,null,null,0]
[null,null,null,null,null,null,null,0]
[null,null,null,null,null,null,null,0]
[null,null,null,null,null,null,null,0]
[null,null,null,null,null,null,null,0]
["Informativ:",null,null,null,null,null,null,0]
["Fusion Oberzent (GKZ 06437016) zum 01.01.2018 (aus Beerfelden, Sensbachtal, Rothenberg, Hesseneck)",null,null,null,null,null,null,0]
["Fusion Wesertal (GKZ 06633030) zum 01.01.2018 (aus Oberweser und Wahlsburg)",null,null,null,null,null,null,0]
[null,null,null,null,null,null,null,0]
[null,null,null,null,null,null,null,0]
[null,null,null,null,null,null,null,0]
[null,null,null,null,null,null,null,0]
[null,null,null,null,null,null,null,0]
[null,null,null,null,null,null,null,0]
[null,null,null,null,null,null,null,0]
[null,null,null,null,null,null,null,0]
[null,null,null,null,null,null,null,0]
[null,null,null,null,null,null,null,0]
[null,null,null,null,null,null,null,0]
[null,null,null,null,null,null,null,0]
[null,null,null,null,null,null,null,0]
[null,null,null,null,null,null,null,0]
[null,null,null,null,null,null,null,0]
[null,null,null,null,null,null,null,0]

{"sheet":"Adressen","index":9,"n_rows":447,"n_cols":15,"rows_kept":447,"cut":false,"hidden":true,"merged":[]}
["GKZ","Kommunen",null,null,null,431000,"Landkreis Bergstraße","An den","Landrat","des Landkreises Bergstraße","Gräffstraße 5",64646,"Heppenheim",null,1]
[6633001,"AHNATAL",{"$f":"VLOOKUP(A2,'antragsberechtigt B'!$C$2:$F$400,3,FALSE)","v":{"$error":"#N/A"}},null,null,432000,"Landkreis Darmstadt-Dieburg","An den","Landrat","des Landkreises Darmstadt-Dieburg","Jägertorstr. 207",64289,"Darmstadt"]
[6632001,"ALHEIM",{"$f":"VLOOKUP(A3,'antragsberechtigt B'!$C$2:$F$400,3,FALSE)","v":{"$error":"#N/A"}},null,null,433000,"Landkreis Groß-Gerau","An den","Landrat","des Landkreises Groß-Gerau","Wilhelm-Seipp-Straße 4",64521,"Groß-Gerau"]
[6531001,"ALLENDORF (LUMDA), STADT",{"$f":"VLOOKUP(A4,'antragsberechtigt B'!$C$2:$F$400,3,FALSE)","v":{"$error":"#N/A"}},null,null,434000,"Hochtaunuskreis","An den","Landrat","des Hochtaunuskreises","Ludwig-Erhard-Anlage 1-4",61348,"Bad Homburg"]
[6535001,"ALSFELD, STADT",{"$f":"VLOOKUP(A5,'antragsberechtigt B'!$C$2:$F$400,3,FALSE)","v":{"$error":"#N/A"}},null,null,435000,"Main-Kinzig-Kreis","An den","Landrat","des Main-Kinzig-Kreises","Barbarossastraße 16-24",63569,"Gelnhausen"]
[6534001,"AMOENEBURG, STADT",{"$f":"VLOOKUP(A6,'antragsberechtigt B'!$C$2:$F$400,3,FALSE)","v":{"$error":"#N/A"}},null,null,436000,"Main-Taunus-Kreis","An den","Landrat","des Main-Taunus-Kreises","Am Kreishaus 1-5",65719,"Hofheim a. T."]
[6534002,"ANGELBURG",{"$f":"VLOOKUP(A7,'antragsberechtigt B'!$C$2:$F$400,3,FALSE)","v":{"$error":"#N/A"}},null,null,437000,"Odenwaldkreis","An den","Landrat","des Odenwaldkreises","Michelstädter Straße 12",64711,"Erbach"]
[6535002,"ANTRIFTTAL",{"$f":"VLOOKUP(A8,'antragsberechtigt B'!$C$2:$F$400,3,FALSE)","v":{"$error":"#N/A"}},null,null,438000,"Landkreis Offenbach","An den","Landrat","des Landkreises Offenbach","Werner-Hilpert-Straße 1",63128,"Dietzenbach"]
[6635002,"BAD AROLSEN, STADT",{"$f":"VLOOKUP(A9,'antragsberechtigt B'!$C$2:$F$400,3,FALSE)","v":{"$error":"#N/A"}},null,null,439000,"Rheingau-Taunus-Kreis","An den","Landrat","des Rheingau-Taunus-Kreises","Heimbacher Straße 7",65307,"Bad Schwalbach"]
[6633006,"BAD EMSTAL",{"$f":"VLOOKUP(A10,'antragsberechtigt B'!$C$2:$F$400,3,FALSE)","v":{"$error":"#N/A"}},null,null,440000,"Wetteraukreis","An den","Landrat","des Wetteraukreises","Europaplatz",61169,"Friedberg (Hessen)"]
[6534003,"BAD ENDBACH",{"$f":"VLOOKUP(A11,'antragsberechtigt B'!$C$2:$F$400,3,FALSE)","v":{"$error":"#N/A"}},null,null,531000,"Landkreis Gießen","An die","Landrätin","des Landkreises Gießen ","Riversplatz 1 - 9",35394,"Gießen"]
[6632002,"BAD HERSFELD, KREISSTADT",{"$f":"VLOOKUP(A12,'antragsberechtigt B'!$C$2:$F$400,3,FALSE)","v":{"$error":"#N/A"}},null,null,532000,"Lahn-Dill-Kreis","An den","Landrat","des Lahn-Dill-Kreises","Karl-Kellner-Ring 51",35576,"Wetzlar"]
[6633002,"BAD KARLSHAFEN, STADT",{"$f":"VLOOKUP(A13,'antragsberechtigt B'!$C$2:$F$400,3,FALSE)","v":{"$error":"#N/A"}},null,null,533000,"Landkreis Limburg-Weilburg","An den","Landrat","des Landkeises Limburg-Weilburg","Schiede 43",65549,"Limburg a.d.Lahn"]
[6437001,"BAD KOENIG, STADT",{"$f":"VLOOKUP(A14,'antragsberechtigt B'!$C$2:$F$400,3,FALSE)","v":{"$error":"#N/A"}},null,null,534000,"Landkreis Marburg-Biedenkopf","An die","Landrätin","des Landkreises Marburg-Biedenkopf","Im Lichtenholz 60",35043,"Marburg"]
[6440002,"BAD NAUHEIM, STADT",{"$f":"VLOOKUP(A15,'antragsberechtigt B'!$C$2:$F$400,3,FALSE)","v":{"$error":"#N/A"}},null,null,535000,"Vogelsbergkreis","An den","Landrat","des Vogelsbergkreises","Goldhelg 20",36341,"Lauterbach"]
[6435001,"BAD ORB, STADT",{"$f":"VLOOKUP(A16,'antragsberechtigt B'!$C$2:$F$400,3,FALSE)","v":{"$error":"#N/A"}},null,null,631000,"Landkreis Fulda","An den","Landrat","des Landkreises Fulda","Wörthstraße 15",36037,"Fulda"]
[6439002,"BAD SCHWALBACH, KREISSTADT",{"$f":"VLOOKUP(A17,'antragsberechtigt B'!$C$2:$F$400,3,FALSE)","v":{"$error":"#N/A"}},null,null,632000,"Landkreis Hersfeld-Rotenburg","An den","Landrat","des Landkreises Hersfeld-Rotenburg","Friedloser Straße 12",36251,"Bad Hersfeld"]
[6435002,"BAD SODEN-SALMUENSTER, STADT",{"$f":"VLOOKUP(A18,'antragsberechtigt B'!$C$2:$F$400,3,FALSE)","v":{"$error":"#N/A"}},null,null,633000,"Landkreis Kassel","An den","Landrat","des Landkreises Kassel","Wilhelmshöher Allee 19-21",34117,"Kassel"]
[6636001,"BAD SOODEN-ALLENDORF, STADT",{"$f":"VLOOKUP(A19,'antragsberechtigt B'!$C$2:$F$400,3,FALSE)","v":{"$error":"#N/A"}},null,null,634000,"Schwalm-Eder-Kreis","An den","Landrat","des Schwalm-Eder-Kreises","Parkstraße 6",34576,"Homberg (Efze)"]
[6635003,"BAD WILDUNGEN, STADT",{"$f":"VLOOKUP(A20,'antragsberechtigt B'!$C$2:$F$400,3,FALSE)","v":{"$error":"#N/A"}},null,null,635000,"Landkreis Waldeck-Frankenberg","An den","Landrat","des Landkreises Waldeck-Frankenberg","Südring 2",34497,"Korbach"]
[6634027,"BAD ZWESTEN",{"$f":"VLOOKUP(A21,'antragsberechtigt B'!$C$2:$F$400,3,FALSE)","v":{"$error":"#N/A"}},null,null,636000,"Werra-Meißner-Kreis","An den","Landrat","des Werra-Meißner-Kreises","Schlossplatz 1",37269,"Eschwege"]
[6632003,"BEBRA, STADT",{"$f":"VLOOKUP(A22,'antragsberechtigt B'!$C$2:$F$400,3,FALSE)","v":{"$error":"#N/A"}},null,null,411000,"Darmstadt, Wissenschaftsstadt","An den","Magistrat","der Wissenschaftsstadt Darmstadt","Luisenplatz 5",64283,"Darmstadt"]
[6437002,"BEERFELDEN, STADT",{"$f":"VLOOKUP(A23,'antragsberechtigt B'!$C$2:$F$400,3,FALSE)","v":{"$error":"#N/A"}},null,null,412000,"Frankfurt am Main, St.","An den","Magistrat","der Stadt Frankfurt","Römerberg 23",60311,"Frankfurt am Main"]
[6533001,"BESELICH",{"$f":"VLOOKUP(A24,'antragsberechtigt B'!$C$2:$F$400,3,FALSE)","v":{"$error":"#N/A"}},null,null,413000,"Offenbach am Main, St.","An den","Magistrat","der Stadt Offenbach","Berliner Straße 100",63065,"Offenbach"]
[6431004,"BIRKENAU",{"$f":"VLOOKUP(A25,'antragsberechtigt B'!$C$2:$F$400,3,FALSE)","v":{"$error":"#N/A"}},null,null,414000,"Wiesbaden, Landeshauptstadt","An den","Magistrat","der Landeshauptstadt Wiesbaden","Schlossplatz 6",65183,"Wiesbaden"]
[6433002,"BISCHOFSHEIM",{"$f":"VLOOKUP(A26,'antragsberechtigt B'!$C$2:$F$400,3,FALSE)","v":{"$error":"#N/A"}},null,null,611000,"Kassel, documenta-Stadt","An den","Magistrat","der documenta-Stadt Kassel","Obere Königsstraße 8",34117,"Kassel"]
[6634001,"BORKEN (HESSEN), STADT",{"$f":"VLOOKUP(A27,'antragsberechtigt B'!$C$2:$F$400,3,FALSE)","v":{"$error":"#N/A"}},null,null,431001,"Abtsteinach","An den","Gemeindevorstand","der Gemeinde Abtsteinach","Kirchstraße 2",69518,"Abtsteinach"]
[6435005,"BRACHTTAL",{"$f":"VLOOKUP(A28,'antragsberechtigt B'!$C$2:$F$400,3,FALSE)","v":{"$error":"#N/A"}},null,null,431002,"Bensheim, St.","An den","Magistrat","der Stadt Bensheim","Kirchbergstraße 18",64625,"Bensheim"]
[6532003,"BRAUNFELS, STADT",{"$f":"VLOOKUP(A29,'antragsberechtigt B'!$C$2:$F$400,3,FALSE)","v":{"$error":"#N/A"}},null,null,431003,"Biblis","An den","Gemeindevorstand","der Gemeinde Biblis","Darmstädter Straße 25",68647,"Biblis"]
[6632004,"BREITENBACH AM HERZBERG",{"$f":"VLOOKUP(A30,'antragsberechtigt B'!$C$2:$F$400,3,FALSE)","v":{"$error":"#N/A"}},null,null,431004,"Birkenau","An den","Gemeindevorstand","der Gemeinde Birkenau","Hauptstraße 119",69488,"Birkenau"]
[6633004,"BREUNA",{"$f":"VLOOKUP(A31,'antragsberechtigt B'!$C$2:$F$400,3,FALSE)","v":{"$error":"#N/A"}},null,null,431005,"Bürstadt, St.","An den","Magistrat","der Stadt Bürstadt","Rathausstraße 2",68642,"Bürstadt"]
[6437005,"BROMBACHTAL",{"$f":"VLOOKUP(A32,'antragsberechtigt B'!$C$2:$F$400,3,FALSE)","v":{"$error":"#N/A"}},null,null,431006,"Einhausen","An den","Gemeindevorstand","der Gemeinde Einhausen","Marktplatz 5",64683,"Einhausen"]
[6635005,"BROMSKIRCHEN",{"$f":"VLOOKUP(A33,'antragsberechtigt B'!$C$2:$F$400,3,FALSE)","v":{"$error":"#N/A"}},null,null,431007,"Fürth","An den","Gemeindevorstand","der Gemeinde Fürth","Hauptstraße 19",64658,"Fürth"]
[6435006,"BRUCHKOEBEL, STADT",{"$f":"VLOOKUP(A34,'antragsberechtigt B'!$C$2:$F$400,3,FALSE)","v":{"$error":"#N/A"}},null,null,431008,"Gorxheimertal","An den","Gemeindevorstand","der Gemeinde Gorxheimertal","Siedlungsstraße 35",69517,"Gorxheimertal"]
[6440004,"BUEDINGEN, STADT",{"$f":"VLOOKUP(A35,'antragsberechtigt B'!$C$2:$F$400,3,FALSE)","v":{"$error":"#N/A"}},null,null,431009,"Grasellenbach","An den","Gemeindevorstand","der Gemeinde Grasellenbach","Schulstraße 1",64689,"Grasellenbach"]
[6431005,"BUERSTADT, STADT",{"$f":"VLOOKUP(A36,'antragsberechtigt B'!$C$2:$F$400,3,FALSE)","v":{"$error":"#N/A"}},null,null,431010,"Groß-Rohrheim","An den","Gemeindevorstand","der Gemeinde Groß-Rohrheim","Rheinstraße 14",68649,"Groß-Rohrheim"]
[6440005,"BUTZBACH, FRIEDRICH-LUDWIG-WEIDIG-STADT",{"$f":"VLOOKUP(A37,'antragsberechtigt B'!$C$2:$F$400,3,FALSE)","v":{"$error":"#N/A"}},null,null,431011,"Heppenheim (Bergstraße), Krst.","An den","Magistrat","der Kreisstadt Heppenheim","Großer Markt 1",64646,"Heppenheim (Bergstraße)"]
[6632005,"CORNBERG",{"$f":"VLOOKUP(A38,'antragsberechtigt B'!$C$2:$F$400,3,FALSE)","v":{"$error":"#N/A"}},null,null,431012,"Hirschhorn (Neckar), St.","An den","Magistrat","der Stadt Hirschhorn","Hauptstraße 17",69434,"Hirschhorn (Neckar)"]
[6534007,"DAUTPHETAL",{"$f":"VLOOKUP(A39,'antragsberechtigt B'!$C$2:$F$400,3,FALSE)","v":{"$error":"#N/A"}},null,null,431013,"Lampertheim, St.","An den","Magistrat","der Stadt Lampertheim","Römerstraße 102",68623,"Lampertheim"]
[6635007,"DIEMELSEE",{"$f":"VLOOKUP(A40,'antragsberechtigt B'!$C$2:$F$400,3,FALSE)","v":{"$error":"#N/A"}},null,null,431014,"Lautertal (Odenwald)","An den","Gemeindevorstand","der Gemeinde Lautertal","Nibelungenstraße 280",64686,"Lautertal (Odenwald)"]
[6438001,"DIETZENBACH, KREISSTADT",{"$f":"VLOOKUP(A41,'antragsberechtigt B'!$C$2:$F$400,3,FALSE)","v":{"$error":"#N/A"}},null,null,431015,"Lindenfels, St.","An den","Magistrat","der Stadt Lindenfels","Burgstraße 39",64678,"Lindenfels"]
[6532006,"DILLENBURG, STADT",{"$f":"VLOOKUP(A42,'antragsberechtigt B'!$C$2:$F$400,3,FALSE)","v":{"$error":"#N/A"}},null,null,431016,"Lorsch, Karolingerstadt","An den","Magistrat","der Karolingerstadt Lorsch","Kaiser-Wilhelm-Platz 1",64653,"Lorsch"]
[6631003,"DIPPERZ",{"$f":"VLOOKUP(A43,'antragsberechtigt B'!$C$2:$F$400,3,FALSE)","v":{"$error":"#N/A"}},null,null,431017,"Mörlenbach","An den","Gemeindevorstand","der Gemeinde Mörlenbach","Rathausplatz 1",69509,"Mörlenbach"]
[6533004,"DORNBURG",{"$f":"VLOOKUP(A44,'antragsberechtigt B'!$C$2:$F$400,3,FALSE)","v":{"$error":"#N/A"}},null,null,431018,"Neckarsteinach, St.","An den","Magistrat","der Stadt Neckarsteinach","Hauptstraße 7",69239,"Neckarsteinach"]
[6631004,"EBERSBURG",{"$f":"VLOOKUP(A45,'antragsberechtigt B'!$C$2:$F$400,3,FALSE)","v":{"$error":"#N/A"}},null,null,431019,"Rimbach","An den","Gemeindevorstand","der Gemeinde Rimbach","Rathausstraße 1",64668,"Rimbach"]
[6534008,"EBSDORFERGRUND",{"$f":"VLOOKUP(A46,'antragsberechtigt B'!$C$2:$F$400,3,FALSE)","v":{"$error":"#N/A"}},null,null,431020,"Viernheim, St.","An den","Magistrat","der Stadt Viernheim","Kettelerstraße 3",68519,"Viernheim"]
[6634002,"EDERMUENDE",{"$f":"VLOOKUP(A47,'antragsberechtigt B'!$C$2:$F$400,3,FALSE)","v":{"$error":"#N/A"}},null,null,431021,"Wald-Michelbach","An den","Gemeindevorstand","der Gemeinde Wald-Michelbach","In der Gass 17",69483,"Wald-Michelbach"]
[6635009,"EDERTAL",{"$f":"VLOOKUP(A48,'antragsberechtigt B'!$C$2:$F$400,3,FALSE)","v":{"$error":"#N/A"}},null,null,431022,"Zwingenberg, St.","An den","Magistrat","der Stadt Zwingenberg","Untergasse 16",64673,"Zwingenberg"]
[6631005,"EHRENBERG (RHOEN)",{"$f":"VLOOKUP(A49,'antragsberechtigt B'!$C$2:$F$400,3,FALSE)","v":{"$error":"#N/A"}},null,null,432001,"Alsbach-Hähnlein","An den","Gemeindevorstand","der Gemeinde Alsbach-Hähnlein","Bickenbacher Straße 6",64665,"Alsbach-Hähnlein"]
[6533005,"ELBTAL",{"$f":"VLOOKUP(A50,'antragsberechtigt B'!$C$2:$F$400,3,FALSE)","v":{"$error":"#N/A"}},null,null,432002,"Babenhausen, St.","An den","Magistrat","der Stadt Babenhausen","Marktplatz 2",64832,"Babenhausen"]
[6437006,"ERBACH, KREISSTADT",{"$f":"VLOOKUP(A51,'antragsberechtigt B'!$C$2:$F$400,3,FALSE)","v":{"$error":"#N/A"}},null,null,432003,"Bickenbach","An den","Gemeindevorstand","der Gemeinde Bickenbach","Darmstädter Straße 7",64404,"Bickenbach"]
[6435007,"ERLENSEE",{"$f":"VLOOKUP(A52,'antragsberechtigt B'!$C$2:$F$400,3,FALSE)","v":{"$error":"#N/A"}},null,null,432004,"Dieburg, St.","An den","Magistrat","der Stadt Dieburg","Markt 4",64807,"Dieburg"]
[6432006,"ERZHAUSEN",{"$f":"VLOOKUP(A53,'antragsberechtigt B'!$C$2:$F$400,3,FALSE)","v":{"$error":"#N/A"}},null,null,432005,"Eppertshausen","An den","Gemeindevorstand","der Gemeinde Eppertshausen","Franz-Gruber-Platz 14",64859,"Eppertshausen"]
[6636003,"ESCHWEGE, KREISSTADT",{"$f":"VLOOKUP(A54,'antragsberechtigt B'!$C$2:$F$400,3,FALSE)","v":{"$error":"#N/A"}},null,null,432006,"Erzhausen","An den","Gemeindevorstand","der Gemeinde Erzhausen","Rodenseestraße 3",64390,"Erzhausen"]
[6633007,"ESPENAU",{"$f":"VLOOKUP(A55,'antragsberechtigt B'!$C$2:$F$400,3,FALSE)","v":{"$error":"#N/A"}},null,null,432007,"Fischbachtal","An den","Gemeindevorstand","der Gemeinde Fischbachtal","Darmstädter Straße 8",64405,"Fischbachtal"]
[6535003,"FELDATAL",{"$f":"VLOOKUP(A56,'antragsberechtigt B'!$C$2:$F$400,3,FALSE)","v":{"$error":"#N/A"}},null,null,432008,"Griesheim, St.","An den","Magistrat","der Stadt Griesheim","Wilhelm-Leuschner-Straße 75",64347,"Griesheim"]
[6634003,"FELSBERG, STADT",{"$f":"VLOOKUP(A57,'antragsberechtigt B'!$C$2:$F$400,3,FALSE)","v":{"$error":"#N/A"}},null,null,432009,"Groß-Bieberau, St.","An den","Magistrat","der Stadt Groß-Bieberau","Marktstraße 28-30",64401,"Groß-Bieberau"]
[6432007,"FISCHBACHTAL",{"$f":"VLOOKUP(A58,'antragsberechtigt B'!$C$2:$F$400,3,FALSE)","v":{"$error":"#N/A"}},null,null,432010,"Groß-Umstadt, St.","An den","Magistrat","der Stadt Groß-Umstadt","Markt 1",64823,"Groß-Umstadt"]
[6631008,"FLIEDEN",{"$f":"VLOOKUP(A59,'antragsberechtigt B'!$C$2:$F$400,3,FALSE)","v":{"$error":"#N/A"}},null,null,432011,"Groß-Zimmern","An den","Gemeindevorstand","der Gemeinde Groß-Zimmern","Rathausplatz 1",64846,"Groß-Zimmern"]
[6435008,"FLOERSBACHTAL",{"$f":"VLOOKUP(A60,'antragsberechtigt B'!$C$2:$F$400,3,FALSE)","v":{"$error":"#N/A"}},null,null,432012,"Messel","An den","Gemeindevorstand","der Gemeinde Messel","Kohlweg 15",64409,"Messel"]
[6436004,"FLOERSHEIM AM MAIN, STADT",{"$f":"VLOOKUP(A61,'antragsberechtigt B'!$C$2:$F$400,3,FALSE)","v":{"$error":"#N/A"}},null,null,432013,"Modautal","An den","Gemeindevorstand","der Gemeinde Modautal","Odenwaldstraße 34",64397,"Modautal"]
[6440007,"FLORSTADT, STADT",{"$f":"VLOOKUP(A62,'antragsberechtigt B'!$C$2:$F$400,3,FALSE)","v":{"$error":"#N/A"}},null,null,432014,"Mühltal","An den","Gemeindevorstand","der Gemeinde Mühltal","Ober-Ramstädter Straße 2-4",64367,"Mühltal"]
[6635010,"FRANKENAU, STADT",{"$f":"VLOOKUP(A63,'antragsberechtigt B'!$C$2:$F$400,3,FALSE)","v":{"$error":"#N/A"}},null,null,432015,"Münster","An den","Gemeindevorstand","der Gemeinde Münster","Mozartstraße 8",64839,"Münster"]
[6635011,"FRANKENBERG (EDER), STADT",{"$f":"VLOOKUP(A64,'antragsberechtigt B'!$C$2:$F$400,3,FALSE)","v":{"$error":"#N/A"}},null,null,432016,"Ober-Ramstadt, St.","An den","Magistrat","der Stadt Ober-Ramstadt","Darmstädter Straße 29",64372,"Ober-Ramstadt"]
[6535004,"FREIENSTEINAU",{"$f":"VLOOKUP(A65,'antragsberechtigt B'!$C$2:$F$400,3,FALSE)","v":{"$error":"#N/A"}},null,null,432017,"Otzberg","An den","Gemeindevorstand","der Gemeinde Otzberg","Otzbergstraße 13",64853,"Otzberg"]
[6435009,"FREIGERICHT",{"$f":"VLOOKUP(A66,'antragsberechtigt B'!$C$2:$F$400,3,FALSE)","v":{"$error":"#N/A"}},null,null,432018,"Pfungstadt, St.","An den","Magistrat","der Stadt Pfungstadt","Kirchstraße 12-14",64319,"Pfungstadt"]
[6440008,"FRIEDBERG (HESSEN), KREISSTADT",{"$f":"VLOOKUP(A67,'antragsberechtigt B'!$C$2:$F$400,3,FALSE)","v":{"$error":"#N/A"}},null,null,432019,"Reinheim, St.","An den","Magistrat","der Stadt Reinheim","Cestas-Platz 1",64354,"Reinheim"]
[6634004,"FRIELENDORF",{"$f":"VLOOKUP(A68,'antragsberechtigt B'!$C$2:$F$400,3,FALSE)","v":{"$error":"#N/A"}},null,null,432020,"Roßdorf","An den","Gemeindevorstand","der Gemeinde Roßdorf","Erbacher Straße 1",64380,"Roßdorf"]
[6634005,"FRITZLAR, DOM- UND KAISERSTADT",{"$f":"VLOOKUP(A69,'antragsberechtigt B'!$C$2:$F$400,3,FALSE)","v":{"$error":"#N/A"}},null,null,432021,"Schaafheim","An den","Gemeindevorstand","der Gemeinde Schaafheim","Wilhelm-Leuschner-Straße 3",64850,"Schaafheim"]
[6431007,"FUERTH",{"$f":"VLOOKUP(A70,'antragsberechtigt B'!$C$2:$F$400,3,FALSE)","v":{"$error":"#N/A"}},null,null,432022,"Seeheim-Jugenheim","An den","Gemeindevorstand","der Gemeinde Seeheim-Jugenheim","Schulstraße 12",64342,"Seeheim-Jugenheim"]
[6631009,"FULDA, STADT",{"$f":"VLOOKUP(A71,'antragsberechtigt B'!$C$2:$F$400,3,FALSE)","v":{"$error":"#N/A"}},null,null,432023,"Weiterstadt, St.","An den","Magistrat","der Stadt  Weiterstadt","Riedbahnstr. 6",64331,"Weiterstadt"]
[6633009,"FULDATAL",{"$f":"VLOOKUP(A72,'antragsberechtigt B'!$C$2:$F$400,3,FALSE)","v":{"$error":"#N/A"}},null,null,433001,"Biebesheim am Rhein","An den","Gemeindevorstand","der Gemeinde Biebesheim/Rhein","Rathausplatz 1",64584,"Biebesheim am Rhein"]
[6439004,"GEISENHEIM, STADT",{"$f":"VLOOKUP(A73,'antragsberechtigt B'!$C$2:$F$400,3,FALSE)","v":{"$error":"#N/A"}},null,null,433002,"Bischofsheim","An den","Gemeindevorstand","der Gemeinde Bischofsheim","Schulstraße 13-15",65474,"Bischofsheim"]
[6535005,"GEMUENDEN (FELDA)",{"$f":"VLOOKUP(A74,'antragsberechtigt B'!$C$2:$F$400,3,FALSE)","v":{"$error":"#N/A"}},null,null,433003,"Büttelborn","An den","Gemeindevorstand","der Gemeinde Büttelborn","Mainzer Straße 13",64572,"Büttelborn"]
[6635012,"GEMUENDEN (WOHRA), STADT",{"$f":"VLOOKUP(A75,'antragsberechtigt B'!$C$2:$F$400,3,FALSE)","v":{"$error":"#N/A"}},null,null,433004,"Gernsheim, Schöfferstadt","An den","Magistrat","der Schöfferstadt Gernsheim","Stadthausplatz 1",64579,"Gernsheim"]
[6631010,"GERSFELD (RHOEN), STADT",{"$f":"VLOOKUP(A76,'antragsberechtigt B'!$C$2:$F$400,3,FALSE)","v":{"$error":"#N/A"}},null,null,433005,"Ginsheim-Gustavsburg, St.","An den","Magistrat","der Stadt Ginsh.-Gustavsburg","Dr. -Herrmann-Straße 32",65462,"Ginsheim-Gustavsburg"]
[6531005,"GIESSEN, UNIVERSITAETSSTADT",{"$f":"VLOOKUP(A77,'antragsberechtigt B'!$C$2:$F$400,3,FALSE)","v":{"$error":"#N/A"}},null,null,433006,"Groß-Gerau, St.","An den","Magistrat","der Stadt Groß-Gerau","Am Marktplatz 1",64521,"Groß-Gerau"]
[6634006,"GILSERBERG",{"$f":"VLOOKUP(A78,'antragsberechtigt B'!$C$2:$F$400,3,FALSE)","v":{"$error":"#N/A"}},null,null,433007,"Kelsterbach, St.","An den","Magistrat","der Stadt Kelsterbach","Mörfelder Straße 33",65451,"Kelsterbach"]
[6534010,"GLADENBACH, STADT",{"$f":"VLOOKUP(A79,'antragsberechtigt B'!$C$2:$F$400,3,FALSE)","v":{"$error":"#N/A"}},null,null,433008,"Mörfelden-Walldorf, St.","An den","Magistrat","der Stadt Mörfelden-Walldorf","Flughafenstraße 37",64546,"Mörfelden-Walldorf"]
[6440010,"GLAUBURG",{"$f":"VLOOKUP(A80,'antragsberechtigt B'!$C$2:$F$400,3,FALSE)","v":{"$error":"#N/A"}},null,null,433009,"Nauheim","An den","Gemeindevorstand","der Gemeinde Nauheim","Weingartenstraße 46-50",64569,"Nauheim"]
[6431008,"GORXHEIMERTAL",{"$f":"VLOOKUP(A81,'antragsberechtigt B'!$C$2:$F$400,3,FALSE)","v":{"$error":"#N/A"}},null,null,433010,"Raunheim, St.","An den","Magistrat","der Stadt Raunheim","Am Stadtzentrum 1",65479,"Raunheim"]
[6431009,"GRASELLENBACH",{"$f":"VLOOKUP(A82,'antragsberechtigt B'!$C$2:$F$400,3,FALSE)","v":{"$error":"#N/A"}},null,null,433011,"Riedstadt, St.","An den","Magistrat","der Stadt Riedstadt","Rathausplatz 1",64560,"Riedstadt"]
[6535006,"GREBENAU, STADT",{"$f":"VLOOKUP(A83,'antragsberechtigt B'!$C$2:$F$400,3,FALSE)","v":{"$error":"#N/A"}},null,null,433012,"Rüsselsheim, St.","An den","Magistrat","der Stadt Rüsselsheim","Marktplatz 4",65428,"Rüsselsheim"]
[6535007,"GREBENHAIN",{"$f":"VLOOKUP(A84,'antragsberechtigt B'!$C$2:$F$400,3,FALSE)","v":{"$error":"#N/A"}},null,null,433013,"Stockstadt am Rhein","An den","Gemeindevorstand","der Gemeinde Stockstadt","Rheinstraße 34-36",64589,"Stockstadt am Rhein"]
[6633010,"GREBENSTEIN, STADT",{"$f":"VLOOKUP(A85,'antragsberechtigt B'!$C$2:$F$400,3,FALSE)","v":{"$error":"#N/A"}},null,null,433014,"Trebur","An den","Gemeindevorstand","der Gemeinde Trebur","Herrngasse 3",65468,"Trebur"]
[6432008,"GRIESHEIM, STADT",{"$f":"VLOOKUP(A86,'antragsberechtigt B'!$C$2:$F$400,3,FALSE)","v":{"$error":"#N/A"}},null,null,434001,"Bad Homburg v. d. Höhe, St.","An den","Magistrat","der Stadt Bad Homburg v.d.Höhe","Rathausplatz 1 ",61348,"Bad Homburg v.d. Höhe"]
[6636004,"GROSSALMERODE, STADT",{"$f":"VLOOKUP(A87,'antragsberechtigt B'!$C$2:$F$400,3,FALSE)","v":{"$error":"#N/A"}},null,null,434002,"Friedrichsdorf, St.","An den","Magistrat","der Stadt Friedrichsdorf","Hugenottenstraße 55",61381,"Friedrichsdorf"]
[6631011,"GROSSENLUEDER",{"$f":"VLOOKUP(A88,'antragsberechtigt B'!$C$2:$F$400,3,FALSE)","v":{"$error":"#N/A"}},null,null,434003,"Glashütten","An den","Gemeindevorstand","der Gemeinde Glashütten","Schlossborner Weg 2",61479,"Glashütten"]
[6435011,"GROSSKROTZENBURG",{"$f":"VLOOKUP(A89,'antragsberechtigt B'!$C$2:$F$400,3,FALSE)","v":{"$error":"#N/A"}},null,null,434004,"Grävenwiesbach","An den","Gemeindevorstand","der Gemeinde Grävenwiesbach","Bahnhofsweg 2a",61279,"Grävenwiesbach"]
[6432010,"GROSS-UMSTADT, STADT",{"$f":"VLOOKUP(A90,'antragsberechtigt B'!$C$2:$F$400,3,FALSE)","v":{"$error":"#N/A"}},null,null,434005,"Königstein im Taunus, St.","An den","Magistrat","der Stadt Königstein","Burgweg 5",61462,"Königstein im Taunus"]
[6432011,"GROSS-ZIMMERN",{"$f":"VLOOKUP(A91,'antragsberechtigt B'!$C$2:$F$400,3,FALSE)","v":{"$error":"#N/A"}},null,null,434006,"Kronberg im Taunus, St.","An den","Magistrat","der Stadt Kronberg","Katharinenstraße 7",61476,"Kronberg im Taunus"]
[6531006,"GRUENBERG, STADT",{"$f":"VLOOKUP(A92,'antragsberechtigt B'!$C$2:$F$400,3,FALSE)","v":{"$error":"#N/A"}},null,null,434007,"Neu-Anspach, St.","An den","Magistrat","der Stadt Neu-Anspach","Bahnhofstraße 26-28",61267,"Neu-Anspach"]
[6634007,"GUDENSBERG, STADT",{"$f":"VLOOKUP(A93,'antragsberechtigt B'!$C$2:$F$400,3,FALSE)","v":{"$error":"#N/A"}},null,null,434008,"Oberursel (Taunus), St.","An den","Magistrat","der Stadt Oberursel","Rathausplatz 1",61440,"Oberursel (Taunus)"]
[6633011,"HABICHTSWALD",{"$f":"VLOOKUP(A94,'antragsberechtigt B'!$C$2:$F$400,3,FALSE)","v":{"$error":"#N/A"}},null,null,434009,"Schmitten","An den","Gemeindevorstand","der Gemeinde Schmitten","Parkstraße 2",61389,"Schmitten"]
[6533007,"HADAMAR, STADT",{"$f":"VLOOKUP(A95,'antragsberechtigt B'!$C$2:$F$400,3,FALSE)","v":{"$error":"#N/A"}},null,null,434010,"Steinbach (Taunus), St.","An den","Magistrat","der Stadt Steinbach","Gartenstraße 20",61449,"Steinbach (Taunus)"]
[6635013,"HAINA (KLOSTER)",{"$f":"VLOOKUP(A96,'antragsberechtigt B'!$C$2:$F$400,3,FALSE)","v":{"$error":"#N/A"}},null,null,434011,"Usingen, St.","An den","Magistrat","der Stadt Usingen","Wilhelmj-Str. 1",61250,"Usingen"]
[6438004,"HAINBURG",{"$f":"VLOOKUP(A97,'antragsberechtigt B'!$C$2:$F$400,3,FALSE)","v":{"$error":"#N/A"}},null,null,434012,"Wehrheim","An den","Gemeindevorstand","der Gemeinde Wehrheim","Dorfborngasse 1",61273,"Wehrheim"]
[6435014,"HANAU, BRUEDER-GRIMM-STADT",{"$f":"VLOOKUP(A98,'antragsberechtigt B'!$C$2:$F$400,3,FALSE)","v":{"$error":"#N/A"}},null,null,434013,"Weilrod","An den","Gemeindevorstand","der Gemeinde Weilrod","Am Senner 1",61276,"Weilrod"]
[6436005,"HATTERSHEIM AM MAIN, STADT",{"$f":"VLOOKUP(A99,'antragsberechtigt B'!$C$2:$F$400,3,FALSE)","v":{"$error":"#N/A"}},null,null,435001,"Bad Orb, St.","An den","Magistrat","der Stadt Bad Orb","Frankfurter Str. 2",63619,"Bad Orb"]
[6632007,"HAUNECK",{"$f":"VLOOKUP(A100,'antragsberechtigt B'!$C$2:$F$400,3,FALSE)","v":{"$error":"#N/A"}},null,null,435002,"Bad Soden-Salmünster, St.","An den","Magistrat","der Stadt Bad Soden-Salmünster","Rathausstraße 1",63628,"Bad Soden-Salmünster"]
[6632008,"HAUNETAL",{"$f":"VLOOKUP(A101,'antragsberechtigt B'!$C$2:$F$400,3,FALSE)","v":{"$error":"#N/A"}},null,null,435003,"Biebergemünd","An den","Gemeindevorstand","der Gemeinde Biebergemünd","Rathaus am Gemeindezentrum",63599,"Biebergemünd"]
[6439005,"HEIDENROD",{"$f":"VLOOKUP(A102,'antragsberechtigt B'!$C$2:$F$400,3,FALSE)","v":{"$error":"#N/A"}},null,null,435004,"Birstein","An den","Gemeindevorstand","der Gemeinde Birstein","Carl-Lomb-Straße 1",63633,"Birstein"]
[6633012,"HELSA",{"$f":"VLOOKUP(A103,'antragsberechtigt B'!$C$2:$F$400,3,FALSE)","v":{"$error":"#N/A"}},null,null,435005,"Brachttal","An den","Gemeindevorstand","der Gemeinde Brachttal","Wächtersbacher Straße 48",63636,"Brachttal"]
[6636005,"HERLESHAUSEN",{"$f":"VLOOKUP(A104,'antragsberechtigt B'!$C$2:$F$400,3,FALSE)","v":{"$error":"#N/A"}},null,null,435006,"Bruchköbel, St.","An den","Magistrat","der Stadt Bruchköbel","Hauptstraße 32",63486,"Bruchköbel"]
[6437008,"HESSENECK",{"$f":"VLOOKUP(A105,'antragsberechtigt B'!$C$2:$F$400,3,FALSE)","v":{"$error":"#N/A"}},null,null,435007,"Erlensee, St.","An den","Magistrat","der Stadt Erlensee","Am Rathaus 3",63526,"Erlensee"]
[6636006,"HESSISCH LICHTENAU, STADT",{"$f":"VLOOKUP(A106,'antragsberechtigt B'!$C$2:$F$400,3,FALSE)","v":{"$error":"#N/A"}},null,null,435008,"Flörsbachtal","An den","Gemeindevorstand","der Gemeinde Flörsbachtal","Hauptstraße 14",63639,"Flörsbachtal"]
[6631012,"HILDERS",{"$f":"VLOOKUP(A107,'antragsberechtigt B'!$C$2:$F$400,3,FALSE)","v":{"$error":"#N/A"}},null,null,435009,"Freigericht","An den","Gemeindevorstand","der Gemeinde Freigericht","Rathausstraße 13",63579,"Freigericht"]
[6440011,"HIRZENHAIN",{"$f":"VLOOKUP(A108,'antragsberechtigt B'!$C$2:$F$400,3,FALSE)","v":{"$error":"#N/A"}},null,null,435010,"Gelnhausen, Barbarossastadt, Krst.","An den","Magistrat","der Kreis- und Barbarossastadt Gelnhausen","Obermarkt 7",63571,"Gelnhausen"]
[6437009,"HOECHST IM ODENWALD",{"$f":"VLOOKUP(A109,'antragsberechtigt B'!$C$2:$F$400,3,FALSE)","v":{"$error":"#N/A"}},null,null,435011,"Großkrotzenburg","An den","Gemeindevorstand","der Gemeinde Großkrotzenburg","Bahnhofstraße 4",63538,"Großkrotzenburg"]
[6631013,"HOFBIEBER",{"$f":"VLOOKUP(A110,'antragsberechtigt B'!$C$2:$F$400,3,FALSE)","v":{"$error":"#N/A"}},null,null,435012,"Gründau","An den","Gemeindevorstand","der Gemeinde Gründau","Am Bürgerzentrum 1",63584,"Gründau"]
[6633013,"HOFGEISMAR, STADT",{"$f":"VLOOKUP(A111,'antragsberechtigt B'!$C$2:$F$400,3,FALSE)","v":{"$error":"#N/A"}},null,null,435013,"Hammersbach","An den","Gemeindevorstand","der Gemeinde Hammersbach","Köbler Weg 44",63546,"Hammersbach"]
[6532013,"HOHENAHR",{"$f":"VLOOKUP(A112,'antragsberechtigt B'!$C$2:$F$400,3,FALSE)","v":{"$error":"#N/A"}},null,null,435014,"Hanau, St.","An den","Magistrat","der Brüder-Grimm-Stadt Hanau","Am Markt 14-18",63450,"Hanau"]
[6632010,"HOHENRODA",{"$f":"VLOOKUP(A113,'antragsberechtigt B'!$C$2:$F$400,3,FALSE)","v":{"$error":"#N/A"}},null,null,435015,"Hasselroth","An den","Gemeindevorstand","der Gemeinde Hasselroth","Bodo-Käppel-Platz 1",63594,"Hasselroth"]
[6634009,"HOMBERG (EFZE), KREISSTADT",{"$f":"VLOOKUP(A114,'antragsberechtigt B'!$C$2:$F$400,3,FALSE)","v":{"$error":"#N/A"}},null,null,435016,"Jossgrund","An den","Gemeindevorstand","der Gemeinde Jossgrund","Martinusstraße 2",63637,"Jossgrund"]
[6631014,"HOSENFELD",{"$f":"VLOOKUP(A115,'antragsberechtigt B'!$C$2:$F$400,3,FALSE)","v":{"$error":"#N/A"}},null,null,435017,"Langenselbold, St.","An den","Magistrat","der Stadt Langenselbold","Schlosspark 2",63505,"Langenselbold"]
[6631015,"HUENFELD, KONRAD-ZUSE-STADT",{"$f":"VLOOKUP(A116,'antragsberechtigt B'!$C$2:$F$400,3,FALSE)","v":{"$error":"#N/A"}},null,null,435018,"Linsengericht","An den","Gemeindevorstand","der Gemeinde Linsengericht","Amtshofstraße 1",63589,"Linsengericht"]
[6533008,"HUENFELDEN",{"$f":"VLOOKUP(A117,'antragsberechtigt B'!$C$2:$F$400,3,FALSE)","v":{"$error":"#N/A"}},null,null,435019,"Maintal, St.","An den","Magistrat","der Stadt Maintal","Klosterhofstraße 4-6",63477,"Maintal"]
[6439007,"HUENSTETTEN",{"$f":"VLOOKUP(A118,'antragsberechtigt B'!$C$2:$F$400,3,FALSE)","v":{"$error":"#N/A"}},null,null,435020,"Neuberg","An den","Gemeindevorstand","der Gemeinde Neuberg","In den Gräben 15",63543,"Neuberg"]
[6531008,"HUNGEN, STADT",{"$f":"VLOOKUP(A119,'antragsberechtigt B'!$C$2:$F$400,3,FALSE)","v":{"$error":"#N/A"}},null,null,435021,"Nidderau, St.","An den","Magistrat","der Stadt Nidderau","Am Steinweg 1",61130,"Nidderau"]
[6633014,"IMMENHAUSEN, STADT",{"$f":"VLOOKUP(A120,'antragsberechtigt B'!$C$2:$F$400,3,FALSE)","v":{"$error":"#N/A"}},null,null,435022,"Niederdorfelden","An den","Gemeindevorstand","der Gemeinde Niederdorfelden","Burgstraße 5",61138,"Niederdorfelden"]
[6634010,"JESBERG",{"$f":"VLOOKUP(A121,'antragsberechtigt B'!$C$2:$F$400,3,FALSE)","v":{"$error":"#N/A"}},null,null,435023,"Rodenbach","An den","Gemeindevorstand","der Gemeinde Rodenbach","Buchbergstraße 2",63517,"Rodenbach"]
[6435016,"JOSSGRUND",{"$f":"VLOOKUP(A122,'antragsberechtigt B'!$C$2:$F$400,3,FALSE)","v":{"$error":"#N/A"}},null,null,435024,"Ronneburg","An den","Gemeindevorstand","der Gemeinde Ronneburg","Schulstraße 9",63549,"Ronneburg"]
[6631016,"KALBACH",{"$f":"VLOOKUP(A123,'antragsberechtigt B'!$C$2:$F$400,3,FALSE)","v":{"$error":"#N/A"}},null,null,435025,"Schlüchtern, St.","An den","Magistrat","der Stadt Schlüchtern","Krämerstraße 2",36381,"Schlüchtern"]
[6611000,"KASSEL, DOCUMENTA-STADT",{"$f":"VLOOKUP(A124,'antragsberechtigt B'!$C$2:$F$400,3,FALSE)","v":{"$error":"#N/A"}},null,null,435026,"Schöneck","An den","Gemeindevorstand","der Gemeinde Schöneck","Herrnhofstraße 8",61137,"Schöneck"]
[6436008,"KELKHEIM (TAUNUS), STADT",{"$f":"VLOOKUP(A125,'antragsberechtigt B'!$C$2:$F$400,3,FALSE)","v":{"$error":"#N/A"}},null,null,435027,"Sinntal","An den","Gemeindevorstand","der Gemeinde Sinntal","Am Rathaus 11",36391,"Sinntal-Sterbfritz"]
[6534011,"KIRCHHAIN, STADT",{"$f":"VLOOKUP(A126,'antragsberechtigt B'!$C$2:$F$400,3,FALSE)","v":{"$error":"#N/A"}},null,null,435028,"Steinau a. d. Straße, St.","An den","Magistrat","der Brüder-Grimm-Stadt Steinau","Brüder-Grimm-Straße 47",36396,"Steinau an der Straße"]
[6535010,"KIRTORF, STADT",{"$f":"VLOOKUP(A127,'antragsberechtigt B'!$C$2:$F$400,3,FALSE)","v":{"$error":"#N/A"}},null,null,435029,"Wächtersbach, St.","An den","Magistrat","der Stadt Wächtersbach","Main-Kinzig-Straße 31",63607,"Wächtersbach"]
[6634011,"KNUELLWALD",{"$f":"VLOOKUP(A128,'antragsberechtigt B'!$C$2:$F$400,3,FALSE)","v":{"$error":"#N/A"}},null,null,436001,"Bad Soden am Taunus, St.","An den","Magistrat","der Stadt Bad Soden","Königsteiner Straße 73",65812,"Bad Soden am Taunus"]
[6635015,"KORBACH, KREISSTADT",{"$f":"VLOOKUP(A129,'antragsberechtigt B'!$C$2:$F$400,3,FALSE)","v":{"$error":"#N/A"}},null,null,436002,"Eppstein, St.","An den","Magistrat","der Stadt Eppstein","Hauptstraße 99",65817,"Eppstein"]
[6631017,"KUENZELL",{"$f":"VLOOKUP(A130,'antragsberechtigt B'!$C$2:$F$400,3,FALSE)","v":{"$error":"#N/A"}},null,null,436003,"Eschborn, St.","An den","Magistrat","der Stadt Eschborn","Rathausplatz 36",65760,"Eschborn"]
[6534012,"LAHNTAL",{"$f":"VLOOKUP(A131,'antragsberechtigt B'!$C$2:$F$400,3,FALSE)","v":{"$error":"#N/A"}},null,null,436004,"Flörsheim am Main, St.","An den","Magistrat","der Stadt Flörsheim","Bahnhofstraße 12",65439,"Flörsheim am Main"]
[6431013,"LAMPERTHEIM, STADT",{"$f":"VLOOKUP(A132,'antragsberechtigt B'!$C$2:$F$400,3,FALSE)","v":{"$error":"#N/A"}},null,null,436005,"Hattersheim am Main, St.","An den","Magistrat","der Stadt Hattersheim","Rathausstraße 10",65795,"Hattersheim am Main"]
[6631000,"LANDKREIS FULDA",{"$f":"VLOOKUP(A133,'antragsberechtigt B'!$C$2:$F$400,3,FALSE)","v":{"$error":"#N/A"}},null,null,436006,"Hochheim am Main, St.","An den","Magistrat","der Stadt Hochheim","Burgeffstraße 30",65239,"Hochheim am Main"]
[6531000,"LANDKREIS GIESSEN",{"$f":"VLOOKUP(A134,'antragsberechtigt B'!$C$2:$F$400,3,FALSE)","v":{"$error":"#N/A"}},null,null,436007,"Hofheim am Taunus, Kreisstadt","An den","Magistrat","der Kreisstadt Hofheim am Taunus","Chinonplatz 2",65719,"Hofheim am Taunus"]
[6533000,"LANDKREIS LIMBURG-WEILBURG",{"$f":"VLOOKUP(A135,'antragsberechtigt B'!$C$2:$F$400,3,FALSE)","v":{"$error":"#N/A"}},null,null,436008,"Kelkheim (Taunus), St.","An den","Magistrat","der Stadt Kelkheim","Gagernring 6",65779,"Kelkheim (Taunus)"]
[6635000,"LANDKREIS WALDECK-FRANKENBERG",{"$f":"VLOOKUP(A136,'antragsberechtigt B'!$C$2:$F$400,3,FALSE)","v":{"$error":"#N/A"}},null,null,436009,"Kriftel","An den","Gemeindevorstand","der Gemeinde Kriftel","Frankfurter Straße 33-37",65830,"Kriftel"]
[6438006,"LANGEN (HESSEN), STADT",{"$f":"VLOOKUP(A137,'antragsberechtigt B'!$C$2:$F$400,3,FALSE)","v":{"$error":"#N/A"}},null,null,436010,"Liederbach am Taunus","An den","Gemeindevorstand","der Gemeinde Liederbach","Villebon-Platz 9-11",65835,"Liederbach am Taunus"]
[6531010,"LAUBACH, STADT",{"$f":"VLOOKUP(A138,'antragsberechtigt B'!$C$2:$F$400,3,FALSE)","v":{"$error":"#N/A"}},null,null,436011,"Schwalbach am Taunus, St.","An den","Magistrat","der Stadt Schwalbach","Marktplatz 1-2",65824,"Schwalbach am Taunus"]
[6535011,"LAUTERBACH (HESSEN), KREISSTADT",{"$f":"VLOOKUP(A139,'antragsberechtigt B'!$C$2:$F$400,3,FALSE)","v":{"$error":"#N/A"}},null,null,436012,"Sulzbach (Taunus)","An den","Gemeindevorstand","der Gemeinde Sulzbach","Hauptstraße 11",65843,"Sulzbach (Taunus)"]
[6535012,"LAUTERTAL (VOGELSBERG)",{"$f":"VLOOKUP(A140,'antragsberechtigt B'!$C$2:$F$400,3,FALSE)","v":{"$error":"#N/A"}},null,null,437001,"Bad König, St.","An den","Magistrat","der Stadt Bad König","Schlossplatz 3",64732,"Bad König"]
[6532016,"LEUN, STADT",{"$f":"VLOOKUP(A141,'antragsberechtigt B'!$C$2:$F$400,3,FALSE)","v":{"$error":"#N/A"}},null,null,437002,"Beerfelden, St.","An den","Magistrat","der Stadt Beerfelden","Metzkeil 1",64743,"Beerfelden"]
[6531011,"LICH, STADT",{"$f":"VLOOKUP(A142,'antragsberechtigt B'!$C$2:$F$400,3,FALSE)","v":{"$error":"#N/A"}},null,null,437003,"Brensbach","An den","Gemeindevorstand","der Gemeinde Brensbach","Ezyer Straße 5",64395,"Brensbach"]
[6635016,"LICHTENFELS, STADT",{"$f":"VLOOKUP(A143,'antragsberechtigt B'!$C$2:$F$400,3,FALSE)","v":{"$error":"#N/A"}},null,null,437004,"Breuberg, St.","An den","Magistrat","der Stadt Breuberg","Ernst-Ludwig-Straße  2-4",64747,"Breuberg"]
[6633016,"LIEBENAU, STADT",{"$f":"VLOOKUP(A144,'antragsberechtigt B'!$C$2:$F$400,3,FALSE)","v":{"$error":"#N/A"}},null,null,437005,"Brombachtal","An den","Gemeindevorstand","der Gemeinde Brombachtal","Hauptstraße  59",64753,"Brombachtal"]
[6431015,"LINDENFELS, STADT",{"$f":"VLOOKUP(A145,'antragsberechtigt B'!$C$2:$F$400,3,FALSE)","v":{"$error":"#N/A"}},null,null,437006,"Erbach, Kreisstadt","An den","Magistrat","der Kreisstadt Erbach","Neckarstraße 3",64711,"Erbach"]
[6533010,"LOEHNBERG",{"$f":"VLOOKUP(A146,'antragsberechtigt B'!$C$2:$F$400,3,FALSE)","v":{"$error":"#N/A"}},null,null,437007,"Fränkisch-Crumbach","An den","Gemeindevorstand","der Gemeinde Fränkisch-Crumbach","Rodensteiner Straße 8",64407,"Fränkisch-Crumbach"]
[6531013,"LOLLAR, STADT",{"$f":"VLOOKUP(A147,'antragsberechtigt B'!$C$2:$F$400,3,FALSE)","v":{"$error":"#N/A"}},null,null,437008,"Hesseneck","An den","Gemeindevorstand","der Gemeinde Hesseneck","Untere Siegfriedstraße 6",64754,"Hesseneck"]
[6439010,"LORCH, STADT",{"$f":"VLOOKUP(A148,'antragsberechtigt B'!$C$2:$F$400,3,FALSE)","v":{"$error":"#N/A"}},null,null,437009,"Höchst i. Odw.","An den","Gemeindevorstand","der Gemeinde Höchst","Montmelianer Platz 4",64739,"Höchst i.Odw."]
[6431016,"LORSCH, KAROLINGERSTADT",{"$f":"VLOOKUP(A149,'antragsberechtigt B'!$C$2:$F$400,3,FALSE)","v":{"$error":"#N/A"}},null,null,437010,"Lützelbach","An den","Gemeindevorstand","der Gemeinde Lützelbach","Mainstraße 1",64750,"Lützelbach"]
[6632012,"LUDWIGSAU",{"$f":"VLOOKUP(A150,'antragsberechtigt B'!$C$2:$F$400,3,FALSE)","v":{"$error":"#N/A"}},null,null,437011,"Michelstadt, St.","An den","Magistrat","der Stadt Michelstadt","Frankfurter Straße 3",64720,"Michelstadt"]
[6437010,"LUETZELBACH",{"$f":"VLOOKUP(A151,'antragsberechtigt B'!$C$2:$F$400,3,FALSE)","v":{"$error":"#N/A"}},null,null,437012,"Mossautal","An den","Gemeindevorstand","der Gemeinde Mossautal","Ortsstraße 124",64756,"Mossautal"]
[6438007,"MAINHAUSEN",{"$f":"VLOOKUP(A152,'antragsberechtigt B'!$C$2:$F$400,3,FALSE)","v":{"$error":"#N/A"}},null,null,437013,"Reichelsheim (Odenwald)","An den","Gemeindevorstand","der Gemeinde Reichelsheim","Bismarckstraße 43",64385,"Reichelsheim (Odenwald)"]
[6435019,"MAINTAL, STADT",{"$f":"VLOOKUP(A153,'antragsberechtigt B'!$C$2:$F$400,3,FALSE)","v":{"$error":"#N/A"}},null,null,437014,"Rothenberg","An den","Gemeindevorstand","der Gemeinde Rothenberg","Hauptstraße 23",64757,"Rothenberg"]
[6636007,"MEINHARD",{"$f":"VLOOKUP(A154,'antragsberechtigt B'!$C$2:$F$400,3,FALSE)","v":{"$error":"#N/A"}},null,null,437015,"Sensbachtal","An den","Gemeindevorstand","der Gemeinde Sensbachtal","Hauptstraße 32",64759,"Sensbachtal"]
[6636008,"MEISSNER",{"$f":"VLOOKUP(A155,'antragsberechtigt B'!$C$2:$F$400,3,FALSE)","v":{"$error":"#N/A"}},null,null,438001,"Dietzenbach, Kreisstadt","An den","Magistrat","der Kreisstadt Dietzenbach","Europaplatz 1",63128,"Dietzenbach"]
[6533011,"MENGERSKIRCHEN, MARKTFLECKEN",{"$f":"VLOOKUP(A156,'antragsberechtigt B'!$C$2:$F$400,3,FALSE)","v":{"$error":"#N/A"}},null,null,438002,"Dreieich, St.","An den","Magistrat","der Stadt Dreieich","Hauptstraße 45",63303,"Dreieich"]
[6437011,"MICHELSTADT, STADT",{"$f":"VLOOKUP(A157,'antragsberechtigt B'!$C$2:$F$400,3,FALSE)","v":{"$error":"#N/A"}},null,null,438003,"Egelsbach","An den","Gemeindevorstand","der Gemeinde Egelsbach","Freiherr-vom-Stein-Straße 13",63329,"Egelsbach"]
[6431017,"MOERLENBACH",{"$f":"VLOOKUP(A158,'antragsberechtigt B'!$C$2:$F$400,3,FALSE)","v":{"$error":"#N/A"}},null,null,438004,"Hainburg","An den","Gemeindevorstand","der Gemeinde Hainburg","Hauptstraße 44",63512,"Hainburg"]
[6634015,"MORSCHEN",{"$f":"VLOOKUP(A159,'antragsberechtigt B'!$C$2:$F$400,3,FALSE)","v":{"$error":"#N/A"}},null,null,438005,"Heusenstamm, St.","An den","Magistrat","der Stadt Heusenstamm","Im Herrngarten 1",63150,"Heusenstamm"]
[6535013,"MUECKE",{"$f":"VLOOKUP(A160,'antragsberechtigt B'!$C$2:$F$400,3,FALSE)","v":{"$error":"#N/A"}},null,null,438006,"Langen (Hessen), St.","An den","Magistrat","der Stadt Langen ","Südliche Ringstraße 80",63225,"Langen (Hessen)"]
[6438008,"MUEHLHEIM AM MAIN, STADT",{"$f":"VLOOKUP(A161,'antragsberechtigt B'!$C$2:$F$400,3,FALSE)","v":{"$error":"#N/A"}},null,null,438007,"Mainhausen","An den","Gemeindevorstand","der Gemeinde Mainhausen","Rheinstraße 3",63533,"Mainhausen"]
[6534015,"MUENCHHAUSEN",{"$f":"VLOOKUP(A162,'antragsberechtigt B'!$C$2:$F$400,3,FALSE)","v":{"$error":"#N/A"}},null,null,438008,"Mühlheim am Main, St.","An den","Magistrat","der Stadt Mühlheim","Friedensstraße 20",63165,"Mühlheim am Main"]
[6432015,"MUENSTER",{"$f":"VLOOKUP(A163,'antragsberechtigt B'!$C$2:$F$400,3,FALSE)","v":{"$error":"#N/A"}},null,null,438009,"Neu-Isenburg, St.","An den","Magistrat","der Stadt Neu-Isenburg","Hugenottenallee 53",63263,"Neu-Isenburg"]
[6633018,"NAUMBURG, STADT",{"$f":"VLOOKUP(A164,'antragsberechtigt B'!$C$2:$F$400,3,FALSE)","v":{"$error":"#N/A"}},null,null,438010,"Obertshausen, St.","An den","Magistrat","der Stadt Obertshausen","Schubertstraße 11",63179,"Obertshausen"]
[6632013,"NENTERSHAUSEN",{"$f":"VLOOKUP(A165,'antragsberechtigt B'!$C$2:$F$400,3,FALSE)","v":{"$error":"#N/A"}},null,null,438011,"Rodgau, St.","An den","Magistrat","der Stadt Rodgau","Hintergasse 15",63110,"Rodgau"]
[6636009,"NEU-EICHENBERG",{"$f":"VLOOKUP(A166,'antragsberechtigt B'!$C$2:$F$400,3,FALSE)","v":{"$error":"#N/A"}},null,null,438012,"Rödermark, St.","An den","Magistrat","der Stadt Rödermark","Dieburger Straße 13-17",63322,"Rödermark"]
[6634016,"NEUENTAL",{"$f":"VLOOKUP(A167,'antragsberechtigt B'!$C$2:$F$400,3,FALSE)","v":{"$error":"#N/A"}},null,null,438013,"Seligenstadt, St.","An den","Magistrat","der Stadt Seligenstadt","Marktplatz 1",63500,"Seligenstadt"]
[6634017,"NEUKIRCHEN (KNUELL), STADT",{"$f":"VLOOKUP(A168,'antragsberechtigt B'!$C$2:$F$400,3,FALSE)","v":{"$error":"#N/A"}},null,null,439001,"Aarbergen","An den","Gemeindevorstand","der Gemeinde Aarbergen","Rathausstraße 1",65326,"Aarbergen"]
[6534016,"NEUSTADT (HESSEN), STADT",{"$f":"VLOOKUP(A169,'antragsberechtigt B'!$C$2:$F$400,3,FALSE)","v":{"$error":"#N/A"}},null,null,439002,"Bad Schwalbach, Kreisstadt","An den","Magistrat","der Kreisstadt Bad Schwalbach","Adolfstraße 38",65307,"Bad Schwalbach"]
[6440016,"NIDDA, STADT",{"$f":"VLOOKUP(A170,'antragsberechtigt B'!$C$2:$F$400,3,FALSE)","v":{"$error":"#N/A"}},null,null,439003,"Eltville am Rhein, St.","An den","Magistrat","der Stadt Eltville","Gutenbergstsraße 13",65343,"Eltville am Rhein"]
[6440017,"NIDDATAL, STADT",{"$f":"VLOOKUP(A171,'antragsberechtigt B'!$C$2:$F$400,3,FALSE)","v":{"$error":"#N/A"}},null,null,439004,"Geisenheim, St.","An den","Magistrat","der Stadt Geisenheim","Rüdesheimer Straße 48",65366,"Geisenheim"]
[6634018,"NIEDENSTEIN, STADT",{"$f":"VLOOKUP(A172,'antragsberechtigt B'!$C$2:$F$400,3,FALSE)","v":{"$error":"#N/A"}},null,null,439005,"Heidenrod","An den","Gemeindevorstand","der Gemeinde Heidenrod","Rathausstraße 9",65321,"Heidenrod"]
[6633019,"NIESTE",{"$f":"VLOOKUP(A173,'antragsberechtigt B'!$C$2:$F$400,3,FALSE)","v":{"$error":"#N/A"}},null,null,439006,"Hohenstein","An den","Gemeindevorstand","der Gemeinde Hohenstein","Schwalbacher Straße 1",65329,"Hohenstein"]
[6631019,"NUESTTAL",{"$f":"VLOOKUP(A174,'antragsberechtigt B'!$C$2:$F$400,3,FALSE)","v":{"$error":"#N/A"}},null,null,439007,"Hünstetten","An den","Gemeindevorstand","der Gemeinde Hünstetten","Im Lagersboden 5",65510,"Hünstetten"]
[6634019,"OBERAULA",{"$f":"VLOOKUP(A175,'antragsberechtigt B'!$C$2:$F$400,3,FALSE)","v":{"$error":"#N/A"}},null,null,439008,"Idstein, St.","An den","Magistrat","der Stadt Idstein","König-Adolf-Platz 2",65510,"Idstein"]
[6438010,"OBERTSHAUSEN, STADT",{"$f":"VLOOKUP(A176,'antragsberechtigt B'!$C$2:$F$400,3,FALSE)","v":{"$error":"#N/A"}},null,null,439009,"Kiedrich","An den","Gemeindevorstand","der Gemeinde Kiedrich","Marktstraße 27",65399,"Kiedrich"]
[6633021,"OBERWESER",{"$f":"VLOOKUP(A177,'antragsberechtigt B'!$C$2:$F$400,3,FALSE)","v":{"$error":"#N/A"}},null,null,439010,"Lorch, St.","An den","Magistrat","der Stadt Lorch","Markt 5",65391,"Lorch"]
[6437000,"ODENWALDKREIS",{"$f":"VLOOKUP(A178,'antragsberechtigt B'!$C$2:$F$400,3,FALSE)","v":{"$error":"#N/A"}},null,null,439011,"Niedernhausen","An den","Gemeindevorstand","der Gemeinde Niedernhausen","Wilrijkplatz",65527,"Niedernhausen"]
[6439012,"OESTRICH-WINKEL, STADT",{"$f":"VLOOKUP(A179,'antragsberechtigt B'!$C$2:$F$400,3,FALSE)","v":{"$error":"#N/A"}},null,null,439012,"Oestrich-Winkel, St.","An den","Magistrat","der Stadt Oestrich-Winkel","Paul-Gerhardt-Weg 1",65375,"Oestrich-Winkel"]
[6413000,"OFFENBACH AM MAIN, STADT",{"$f":"VLOOKUP(A180,'antragsberechtigt B'!$C$2:$F$400,3,FALSE)","v":{"$error":"#N/A"}},null,null,439013,"Rüdesheim am Rhein, St.","An den","Magistrat","der Stadt Rüdesheim","Markt 16",65385,"Rüdesheim am Rhein"]
[6440019,"ORTENBERG, STADT",{"$f":"VLOOKUP(A181,'antragsberechtigt B'!$C$2:$F$400,3,FALSE)","v":{"$error":"#N/A"}},null,null,439014,"Schlangenbad","An den","Gemeindevorstand","der Gemeinde Schlangenbad","Rheingauer Straße 23",65388,"Schlangenbad"]
[6634020,"OTTRAU",{"$f":"VLOOKUP(A182,'antragsberechtigt B'!$C$2:$F$400,3,FALSE)","v":{"$error":"#N/A"}},null,null,439015,"Taunusstein, St.","An den","Magistrat","der Stadt Taunusstein","Aarstraße 150",65232,"Taunusstein"]
[6432018,"PFUNGSTADT, STADT",{"$f":"VLOOKUP(A183,'antragsberechtigt B'!$C$2:$F$400,3,FALSE)","v":{"$error":"#N/A"}},null,null,439016,"Waldems","An den","Gemeindevorstand","der Gemeinde Waldems","Schulgasse 2",65529,"Waldems"]
[6531014,"POHLHEIM, STADT",{"$f":"VLOOKUP(A184,'antragsberechtigt B'!$C$2:$F$400,3,FALSE)","v":{"$error":"#N/A"}},null,null,439017,"Walluf","An den","Gemeindevorstand","der Gemeinde Walluf","Mühlstraße 40",65396,"Walluf"]
[6631021,"POPPENHAUSEN (WASSERKUPPE)",{"$f":"VLOOKUP(A185,'antragsberechtigt B'!$C$2:$F$400,3,FALSE)","v":{"$error":"#N/A"}},null,null,440001,"Altenstadt","An den","Gemeindevorstand","der Gemeinde Altenstadt","Frankfurter Straße 11",63674,"Altenstadt"]
[6531015,"RABENAU",{"$f":"VLOOKUP(A186,'antragsberechtigt B'!$C$2:$F$400,3,FALSE)","v":{"$error":"#N/A"}},null,null,440002,"Bad Nauheim, St.","An den","Magistrat","der Stadt Bad Nauheim","Parkstraße 36-38",61231,"Bad Nauheim"]
[6534017,"RAUSCHENBERG, STADT",{"$f":"VLOOKUP(A187,'antragsberechtigt B'!$C$2:$F$400,3,FALSE)","v":{"$error":"#N/A"}},null,null,440003,"Bad Vilbel, St.","An den","Magistrat","der Stadt Bad Vilbel","Parkstraße 15",61118,"Bad Vilbel"]
[6437013,"REICHELSHEIM (ODENWALD)",{"$f":"VLOOKUP(A188,'antragsberechtigt B'!$C$2:$F$400,3,FALSE)","v":{"$error":"#N/A"}},null,null,440004,"Büdingen, St.","An den","Magistrat","der Stadt Büdingen","Eberhard-Bauner-Allee 16",63654,"Büdingen"]
[6633022,"REINHARDSHAGEN",{"$f":"VLOOKUP(A189,'antragsberechtigt B'!$C$2:$F$400,3,FALSE)","v":{"$error":"#N/A"}},null,null,440005,"Butzbach, St.","An den","Magistrat","der Stadt Butzbach","Schlossplatz 1",35510,"Butzbach"]
[6433011,"RIEDSTADT, STADT",{"$f":"VLOOKUP(A190,'antragsberechtigt B'!$C$2:$F$400,3,FALSE)","v":{"$error":"#N/A"}},null,null,440006,"Echzell","An den","Gemeindevorstand","der Gemeinde Echzell","Lindenstraße 9",61209,"Echzell"]
[6636010,"RINGGAU",{"$f":"VLOOKUP(A191,'antragsberechtigt B'!$C$2:$F$400,3,FALSE)","v":{"$error":"#N/A"}},null,null,440007,"Florstadt, St.","An den","Magistrat","der Stadt Florstadt","Freiherr-vom-Stein-Straße 1",61197,"Florstadt"]
[6438011,"RODGAU, STADT",{"$f":"VLOOKUP(A192,'antragsberechtigt B'!$C$2:$F$400,3,FALSE)","v":{"$error":"#N/A"}},null,null,440008,"Friedberg (Hessen), Kreisstadt","An den","Magistrat","der Kreisstadt Friedberg","Mainzer-Tor-Anlage 6",61169,"Friedberg (Hessen)"]
[6438012,"ROEDERMARK, STADT",{"$f":"VLOOKUP(A193,'antragsberechtigt B'!$C$2:$F$400,3,FALSE)","v":{"$error":"#N/A"}},null,null,440009,"Gedern, St.","An den","Magistrat","der Stadt Gedern","Schlossberg 7",63688,"Gedern"]
[6535014,"ROMROD, STADT",{"$f":"VLOOKUP(A194,'antragsberechtigt B'!$C$2:$F$400,3,FALSE)","v":{"$error":"#N/A"}},null,null,440010,"Glauburg","An den","Gemeindevorstand","der Gemeinde Glauburg","Bahnhofstraße 34",63695,"Glauburg"]
[6632017,"RONSHAUSEN",{"$f":"VLOOKUP(A195,'antragsberechtigt B'!$C$2:$F$400,3,FALSE)","v":{"$error":"#N/A"}},null,null,440011,"Hirzenhain","An den","Gemeindevorstand","der Gemeinde Hirzenhain","Karl-Birx-Straße 6",63697,"Hirzenhain"]
[6635017,"ROSENTHAL, STADT",{"$f":"VLOOKUP(A196,'antragsberechtigt B'!$C$2:$F$400,3,FALSE)","v":{"$error":"#N/A"}},null,null,440012,"Karben, St.","An den","Magistrat","der Stadt Karben","Rathausplatz 1",61184,"Karben"]
[6632018,"ROTENBURG AN DER FULDA, STADT",{"$f":"VLOOKUP(A197,'antragsberechtigt B'!$C$2:$F$400,3,FALSE)","v":{"$error":"#N/A"}},null,null,440013,"Kefenrod","An den","Gemeindevorstand","der Gemeinde Kefenrod","Hitzkirchener Straße 19",63699,"Kefenrod"]
[6437014,"ROTHENBERG",{"$f":"VLOOKUP(A198,'antragsberechtigt B'!$C$2:$F$400,3,FALSE)","v":{"$error":"#N/A"}},null,null,440014,"Limeshain","An den","Gemeindevorstand","der Gemeinde Limeshain","Am Zentrum 2",63694,"Limeshain"]
[6439013,"RUEDESHEIM AM RHEIN, STADT",{"$f":"VLOOKUP(A199,'antragsberechtigt B'!$C$2:$F$400,3,FALSE)","v":{"$error":"#N/A"}},null,null,440015,"Münzenberg, St.","An den","Magistrat","der Stadt Münzenberg","Hauptstraße 22",35516,"Münzenberg"]
[6433012,"RUESSELSHEIM, STADT",{"$f":"VLOOKUP(A200,'antragsberechtigt B'!$C$2:$F$400,3,FALSE)","v":{"$error":"#N/A"}},null,null,440016,"Nidda, St.","An den","Magistrat","der Stadt Nidda","Wilhelm-Eckhardt-Platz",63667,"Nidda"]
[6432021,"SCHAAFHEIM",{"$f":"VLOOKUP(A201,'antragsberechtigt B'!$C$2:$F$400,3,FALSE)","v":{"$error":"#N/A"}},null,null,440017,"Niddatal, St.","An den","Magistrat","der Stadt Niddatal","Hauptstraße 2",61194,"Niddatal"]
[6633023,"SCHAUENBURG",{"$f":"VLOOKUP(A202,'antragsberechtigt B'!$C$2:$F$400,3,FALSE)","v":{"$error":"#N/A"}},null,null,440018,"Ober-Mörlen","An den","Gemeindevorstand","der Gemeinde Ober-Mörlen","Frankfurter Straße 31",61239,"Ober-Mörlen"]
[6632019,"SCHENKLENGSFELD",{"$f":"VLOOKUP(A203,'antragsberechtigt B'!$C$2:$F$400,3,FALSE)","v":{"$error":"#N/A"}},null,null,440019,"Ortenberg, St.","An den","Magistrat","der Stadt Ortenberg","Lauterbacher Straße 2",63683,"Ortenberg"]
[6535015,"SCHLITZ, STADT",{"$f":"VLOOKUP(A204,'antragsberechtigt B'!$C$2:$F$400,3,FALSE)","v":{"$error":"#N/A"}},null,null,440020,"Ranstadt","An den","Gemeindevorstand","der Gemeinde Ranstadt","Hauptstraße 15",63691,"Ranstadt"]
[6435025,"SCHLUECHTERN, STADT",{"$f":"VLOOKUP(A205,'antragsberechtigt B'!$C$2:$F$400,3,FALSE)","v":{"$error":"#N/A"}},null,null,440021,"Reichelsheim (Wetterau), St.","An den","Magistrat","der Stadt Reichelsheim","Bingenheimer Straße 1",61203,"Reichelsheim (Wetterau)"]
[6532018,"SCHOEFFENGRUND",{"$f":"VLOOKUP(A206,'antragsberechtigt B'!$C$2:$F$400,3,FALSE)","v":{"$error":"#N/A"}},null,null,440022,"Rockenberg","An den","Gemeindevorstand","der Gemeinde Rockenberg","Obergasse 12",35519,"Rockenberg"]
[6535016,"SCHOTTEN, STADT",{"$f":"VLOOKUP(A207,'antragsberechtigt B'!$C$2:$F$400,3,FALSE)","v":{"$error":"#N/A"}},null,null,440023,"Rosbach v.d. Höhe, St.","An den","Magistrat","der Stadt Rosbach","Homburger Straße 64",61191,"Rosbach v.d.Höhe"]
[6634021,"SCHRECKSBACH",{"$f":"VLOOKUP(A208,'antragsberechtigt B'!$C$2:$F$400,3,FALSE)","v":{"$error":"#N/A"}},null,null,440024,"Wölfersheim","An den","Gemeindevorstand","der Gemeinde Wölfersheim","Hauptstraße 60",61200,"Wölfersheim"]
[6634000,"SCHWALM-EDER-KREIS",{"$f":"VLOOKUP(A209,'antragsberechtigt B'!$C$2:$F$400,3,FALSE)","v":{"$error":"#N/A"}},null,null,440025,"Wöllstadt","An den","Gemeindevorstand","der Gemeinde Wöllstadt","Paul-Hallmann-Straße 3",61206,"Wöllstadt"]
[6634022,"SCHWALMSTADT, STADT",{"$f":"VLOOKUP(A210,'antragsberechtigt B'!$C$2:$F$400,3,FALSE)","v":{"$error":"#N/A"}},null,null,531001,"Allendorf (Lumda), St.","An den","Magistrat","der Stadt Allendorf","Bahnhofstraße 14",35469,"Allendorf (Lumda)"]
[6535017,"SCHWALMTAL",{"$f":"VLOOKUP(A211,'antragsberechtigt B'!$C$2:$F$400,3,FALSE)","v":{"$error":"#N/A"}},null,null,531002,"Biebertal","An den","Gemeindevorstand","der Gemeinde Biebertal","Mühlbergstraße 9",35444,"Biebertal"]
[6634023,"SCHWARZENBORN, STADT",{"$f":"VLOOKUP(A212,'antragsberechtigt B'!$C$2:$F$400,3,FALSE)","v":{"$error":"#N/A"}},null,null,531003,"Buseck","An den","Gemeindevorstand","der Gemeinde Buseck","Ernst-Ludwig-Straße 15",35418,"Buseck"]
[6533014,"SELTERS (TAUNUS)",{"$f":"VLOOKUP(A213,'antragsberechtigt B'!$C$2:$F$400,3,FALSE)","v":{"$error":"#N/A"}},null,null,531004,"Fernwald","An den","Gemeindevorstand","der Gemeinde Fernwald","Oppenröder Straße 1",35463,"Fernwald"]
[6437015,"SENSBACHTAL",{"$f":"VLOOKUP(A214,'antragsberechtigt B'!$C$2:$F$400,3,FALSE)","v":{"$error":"#N/A"}},null,null,531005,"Gießen, Universitätsstadt","An den","Magistrat","der Universitätsstadt Gießen","Berliner Platz 1 - 3",35390,"Gießen"]
[6532019,"SIEGBACH",{"$f":"VLOOKUP(A215,'antragsberechtigt B'!$C$2:$F$400,3,FALSE)","v":{"$error":"#N/A"}},null,null,531006,"Grünberg, St.","An den","Magistrat","der Stadt Grünberg","Rabegasse 1",35305,"Grünberg"]
[6435027,"SINNTAL",{"$f":"VLOOKUP(A216,'antragsberechtigt B'!$C$2:$F$400,3,FALSE)","v":{"$error":"#N/A"}},null,null,531007,"Heuchelheim","An den","Gemeindevorstand","der Gemeinde Heuchelheim","Linnpfad 30",35452,"Heuchelheim"]
[6633024,"SOEHREWALD",{"$f":"VLOOKUP(A217,'antragsberechtigt B'!$C$2:$F$400,3,FALSE)","v":{"$error":"#N/A"}},null,null,531008,"Hungen, St.","An den","Magistrat","der Stadt Hungen","Kaiserstraße 7",35410,"Hungen"]
[6636011,"SONTRA, STADT",{"$f":"VLOOKUP(A218,'antragsberechtigt B'!$C$2:$F$400,3,FALSE)","v":{"$error":"#N/A"}},null,null,531009,"Langgöns","An den","Gemeindevorstand","der Gemeinde Langgöns","St. Ulrich Ring 13",35428,"Langgöns"]
[6531017,"STAUFENBERG, STADT",{"$f":"VLOOKUP(A219,'antragsberechtigt B'!$C$2:$F$400,3,FALSE)","v":{"$error":"#N/A"}},null,null,531010,"Laubach, St.","An den","Magistrat","der Stadt Laubach","Friedrichstraße 11",35321,"Laubach"]
[6435028,"STEINAU AN DER STRASSE, BRUEDER-GRIMM-STADT",{"$f":"VLOOKUP(A220,'antragsberechtigt B'!$C$2:$F$400,3,FALSE)","v":{"$error":"#N/A"}},null,null,531011,"Lich, St.","An den","Magistrat","der Stadt Lich","Unterstadt 1",35423,"Lich"]
[6631023,"TANN (RHOEN), STADT",{"$f":"VLOOKUP(A221,'antragsberechtigt B'!$C$2:$F$400,3,FALSE)","v":{"$error":"#N/A"}},null,null,531012,"Linden, St.","An den","Magistrat","der Stadt Linden","Konrad-Adenauer-Straße 25",35440,"Linden"]
[6633025,"TRENDELBURG, STADT",{"$f":"VLOOKUP(A222,'antragsberechtigt B'!$C$2:$F$400,3,FALSE)","v":{"$error":"#N/A"}},null,null,531013,"Lollar, St.","An den","Magistrat","der Stadt Lollar","Holzmühler Weg 76",35457,"Lollar"]
[6635018,"TWISTETAL",{"$f":"VLOOKUP(A223,'antragsberechtigt B'!$C$2:$F$400,3,FALSE)","v":{"$error":"#N/A"}},null,null,531014,"Pohlheim, St.","An den","Magistrat","der Stadt Pohlheim","Ludwigstraße 31",35415,"Pohlheim"]
[6434011,"USINGEN, STADT",{"$f":"VLOOKUP(A224,'antragsberechtigt B'!$C$2:$F$400,3,FALSE)","v":{"$error":"#N/A"}},null,null,531015,"Rabenau","An den","Gemeindevorstand","der Gemeinde Rabenau","Eichweg 14",35466,"Rabenau"]
[6633026,"VELLMAR, STADT",{"$f":"VLOOKUP(A225,'antragsberechtigt B'!$C$2:$F$400,3,FALSE)","v":{"$error":"#N/A"}},null,null,531016,"Reiskirchen","An den","Gemeindevorstand","der Gemeinde Reiskirchen","Schulstraße 17",35447,"Reiskirchen"]
[6431020,"VIERNHEIM, STADT",{"$f":"VLOOKUP(A226,'antragsberechtigt B'!$C$2:$F$400,3,FALSE)","v":{"$error":"#N/A"}},null,null,531017,"Staufenberg, St.","An den","Magistrat","der Stadt Staufenberg","Tarjan-Platz 1",35460,"Staufenberg"]
[6533015,"VILLMAR, MARKTFLECKEN",{"$f":"VLOOKUP(A227,'antragsberechtigt B'!$C$2:$F$400,3,FALSE)","v":{"$error":"#N/A"}},null,null,531018,"Wettenberg","An den","Gemeindevorstand","der Gemeinde Wettenberg","Sorguesplatz 1-2",35435,"Wettenberg"]
[6635019,"VOEHL",{"$f":"VLOOKUP(A228,'antragsberechtigt B'!$C$2:$F$400,3,FALSE)","v":{"$error":"#N/A"}},null,null,532001,"Aßlar, St.","An den","Magistrat","der Stadt Aßlar","Mühlgrabenstraße 1",35614,"Aßlar"]
[6535000,"VOGELSBERGKREIS",{"$f":"VLOOKUP(A229,'antragsberechtigt B'!$C$2:$F$400,3,FALSE)","v":{"$error":"#N/A"}},null,null,532002,"Bischoffen","An den","Gemeindevorstand","der Gemeinde Bischoffen","Schulstraße 23",35649,"Bischoffen"]
[6634025,"WABERN",{"$f":"VLOOKUP(A230,'antragsberechtigt B'!$C$2:$F$400,3,FALSE)","v":{"$error":"#N/A"}},null,null,532003,"Braunfels, St.","An den","Magistrat","der Stadt Braunfels","Hüttenweg 3",35619,"Braunfels"]
[6435029,"WAECHTERSBACH, STADT",{"$f":"VLOOKUP(A231,'antragsberechtigt B'!$C$2:$F$400,3,FALSE)","v":{"$error":"#N/A"}},null,null,532004,"Breitscheid","An den","Gemeindevorstand","der Gemeinde Breitscheid","Rathausstraße 14",35767,"Breitscheid"]
[6633027,"WAHLSBURG",{"$f":"VLOOKUP(A232,'antragsberechtigt B'!$C$2:$F$400,3,FALSE)","v":{"$error":"#N/A"}},null,null,532005,"Dietzhölztal","An den","Gemeindevorstand","der Gemeinde Dietzhölztal","Hauptstraße 92",35716,"Dietzhölztal"]
[6533016,"WALDBRUNN (WESTERWALD)",{"$f":"VLOOKUP(A233,'antragsberechtigt B'!$C$2:$F$400,3,FALSE)","v":{"$error":"#N/A"}},null,null,532006,"Dillenburg, St.","An den","Magistrat","der Stadt Dillenburg","Rathausstraße 7",35683,"Dillenburg"]
[6635021,"WALDECK, STADT",{"$f":"VLOOKUP(A234,'antragsberechtigt B'!$C$2:$F$400,3,FALSE)","v":{"$error":"#N/A"}},null,null,532007,"Driedorf","An den","Gemeindevorstand","der Gemeinde Driedorf","Wilhelmstraße 16",35759,"Driedorf"]
[6636012,"WALDKAPPEL, STADT",{"$f":"VLOOKUP(A235,'antragsberechtigt B'!$C$2:$F$400,3,FALSE)","v":{"$error":"#N/A"}},null,null,532008,"Ehringshausen","An den","Gemeindevorstand","der Gemeinde Ehringshausen","Rathausstraße 1",35630,"Ehringshausen"]
[6431021,"WALD-MICHELBACH",{"$f":"VLOOKUP(A236,'antragsberechtigt B'!$C$2:$F$400,3,FALSE)","v":{"$error":"#N/A"}},null,null,532009,"Eschenburg","An den","Gemeindevorstand","der Gemeinde Eschenburg","Nassauer Straße 11",35713,"Eschenburg"]
[6532022,"WALDSOLMS",{"$f":"VLOOKUP(A237,'antragsberechtigt B'!$C$2:$F$400,3,FALSE)","v":{"$error":"#N/A"}},null,null,532010,"Greifenstein","An den","Gemeindevorstand","der Gemeinde Greifenstein","Herborner Straße 38",35753,"Greifenstein"]
[6636013,"WANFRIED, STADT",{"$f":"VLOOKUP(A238,'antragsberechtigt B'!$C$2:$F$400,3,FALSE)","v":{"$error":"#N/A"}},null,null,532011,"Haiger, St.","An den","Magistrat","der Stadt Haiger","Marktplatz 7",35708,"Haiger"]
[6636014,"WEHRETAL",{"$f":"VLOOKUP(A239,'antragsberechtigt B'!$C$2:$F$400,3,FALSE)","v":{"$error":"#N/A"}},null,null,532012,"Herborn, St.","An den","Magistrat","der Stadt Herborn","Hauptstraße 39",35745,"Herborn"]
[6533017,"WEILBURG, STADT",{"$f":"VLOOKUP(A240,'antragsberechtigt B'!$C$2:$F$400,3,FALSE)","v":{"$error":"#N/A"}},null,null,532013,"Hohenahr","An den","Gemeindevorstand","der Gemeinde Hohenahr","Rathausplatz 6",35644,"Hohenahr"]
[6533018,"WEILMUENSTER, MARKTFLECKEN",{"$f":"VLOOKUP(A241,'antragsberechtigt B'!$C$2:$F$400,3,FALSE)","v":{"$error":"#N/A"}},null,null,532014,"Hüttenberg","An den","Gemeindevorstand","der Gemeinde Hüttenberg","Frankfurter Str. 49-51",35625,"Hüttenberg"]
[6533019,"WEINBACH",{"$f":"VLOOKUP(A242,'antragsberechtigt B'!$C$2:$F$400,3,FALSE)","v":{"$error":"#N/A"}},null,null,532015,"Lahnau","An den","Gemeindevorstand","der Gemeinde Lahnau","Rathausplatz 1-5",35633,"Lahnau"]
[6636015,"WEISSENBORN",{"$f":"VLOOKUP(A243,'antragsberechtigt B'!$C$2:$F$400,3,FALSE)","v":{"$error":"#N/A"}},null,null,532016,"Leun, St.","An den","Magistrat","der Stadt Leun","Bahnhofstraße 25",35638,"Leun"]
[6636000,"WERRA-MEISSNER-KREIS",{"$f":"VLOOKUP(A244,'antragsberechtigt B'!$C$2:$F$400,3,FALSE)","v":{"$error":"#N/A"}},null,null,532017,"Mittenaar","An den","Gemeindevorstand","der Gemeinde Mittenaar","Leipziger Straße 1",35756,"Mittenaar"]
[6534021,"WETTER (HESSEN), STADT",{"$f":"VLOOKUP(A245,'antragsberechtigt B'!$C$2:$F$400,3,FALSE)","v":{"$error":"#N/A"}},null,null,532018,"Schöffengrund","An den","Gemeindevorstand","der Gemeinde Schöffengrund","Neukirchener Straße 5",35641,"Schöffengrund"]
[6532023,"WETZLAR, STADT",{"$f":"VLOOKUP(A246,'antragsberechtigt B'!$C$2:$F$400,3,FALSE)","v":{"$error":"#N/A"}},null,null,532019,"Siegbach","An den","Gemeindevorstand","der Gemeinde Siegbach","Austraße 23",35768,"Siegbach"]
[6632020,"WILDECK",{"$f":"VLOOKUP(A247,'antragsberechtigt B'!$C$2:$F$400,3,FALSE)","v":{"$error":"#N/A"}},null,null,532020,"Sinn","An den","Gemeindevorstand","der Gemeinde Sinn","Jordanstraße 2",35764,"Sinn"]
[6634026,"WILLINGSHAUSEN",{"$f":"VLOOKUP(A248,'antragsberechtigt B'!$C$2:$F$400,3,FALSE)","v":{"$error":"#N/A"}},null,null,532021,"Solms, St.","An den","Magistrat","der Stadt Solms","Oberndorfer Straße 20",35606,"Solms"]
[6636016,"WITZENHAUSEN, STADT",{"$f":"VLOOKUP(A249,'antragsberechtigt B'!$C$2:$F$400,3,FALSE)","v":{"$error":"#N/A"}},null,null,532022,"Waldsolms","An den","Gemeindevorstand","der Gemeinde Waldsolms","Lindenplatz 2",35647,"Waldsolms"]
[6440024,"WOELFERSHEIM",{"$f":"VLOOKUP(A250,'antragsberechtigt B'!$C$2:$F$400,3,FALSE)","v":{"$error":"#N/A"}},null,null,532023,"Wetzlar, St.","An den","Magistrat","der Stadt Wetzlar","Ernst-Leitz-Straße 30",35578,"Wetzlar"]
[6534022,"WOHRATAL",{"$f":"VLOOKUP(A251,'antragsberechtigt B'!$C$2:$F$400,3,FALSE)","v":{"$error":"#N/A"}},null,null,533001,"Beselich","An den","Gemeindevorstand","der Gemeinde Beselich","Steinbacher Straße 10",65614,"Beselich"]
[6633028,"WOLFHAGEN, STADT",{"$f":"VLOOKUP(A252,'antragsberechtigt B'!$C$2:$F$400,3,FALSE)","v":{"$error":"#N/A"}},null,null,533002,"Brechen","An den","Gemeindevorstand","der Gemeinde Brechen","Marktstraße 1",65611,"Brechen"]
[6633029,"ZIERENBERG, STADT",{"$f":"VLOOKUP(A253,'antragsberechtigt B'!$C$2:$F$400,3,FALSE)","v":{"$error":"#N/A"}},null,null,533003,"Bad Camberg, St.","An den","Magistrat","der Stadt Bad Camberg","Am Amthof 15",65520,"Bad Camberg"]
[null,null,null,null,null,533004,"Dornburg","An den","Gemeindevorstand","der Gemeinde Dornburg","Egenolfstraße 26",65599,"Dornburg"]
[null,null,null,null,null,533005,"Elbtal","An den","Gemeindevorstand","der Gemeinde Elbtal","Rathausstraße 1",65627,"Elbtal"]
[6631000,"LANDKREIS FULDA","Kreis Fulda",null,null,533006,"Elz","An den","Gemeindevorstand","der Gemeinde Elz","Rathausstraße 39",65604,"Elz"]
[6531000,"LANDKREIS GIESSEN","Kreis Gießen",null,null,533007,"Hadamar, St.","An den","Magistrat","der Stadt Hadamar","Untermarkt 1",65589,"Hadamar"]
[6533000,"LANDKREIS LIMBURG-WEILBURG","Kreis Limburg-Weilburg",null,null,533008,"Hünfelden","An den","Gemeindevorstand","der Gemeinde Hünfelden","Le-Thillay-Platz",65597,"Hünfelden"]
[6635000,"LANDKREIS WALDECK-FRANKENBERG","Kreis Waldeck-Frankenberg",null,null,533009,"Limburg a.d.Lahn, Kreisstadt","An den","Magistrat","der Kreisstadt Limburg a.d. Lahn","Werner-Senger-Straße 10",65549,"Limburg a.d.Lahn"]
[6437000,"ODENWALDKREIS","Odenwaldkreis",null,null,533010,"Löhnberg","An den","Gemeindevorstand","der Gemeinde Löhnberg","Obertorstraße 5",35792,"Löhnberg"]
[6634000,"SCHWALM-EDER-KREIS","Schwalm-Eder-Kreis",null,null,533011,"Mengerskirchen, Marktflecken","An den","Gemeindevorstand","des Marktfleckens Mengerskirchen","Schlossstraße 3",35794,"Mengerskirchen"]
[6535000,"VOGELSBERGKREIS","Vogelsbergkreis",null,null,533012,"Merenberg, Marktflecken","An den","Gemeindevorstand","des Marktfleckens Merenberg","Allendorfer Straße 4",35799,"Merenberg"]
[6636000,"WERRA-MEISSNER-KREIS","Werra-Meißner-Kreis",null,null,533013,"Runkel, St.","An den","Magistrat","der Stadt Runkel","Burgstraße 4",65594,"Runkel"]
[null,null,null,null,null,533014,"Selters (Taunus)","An den","Gemeindevorstand","der Gemeinde Selters","Brunnenstraße 46",65618,"Selters (Taunus)"]
[null,null,null,null,null,533015,"Villmar, Marktflecken","An den","Gemeindevorstand","des Marktfleckens Villmar","Peter-Paul-Straße 30",65606,"Villmar"]
[null,null,null,null,null,533016,"Waldbrunn (Westerwald)","An den","Gemeindevorstand","der Gemeinde Waldbrunn","Hauser Kirchweg",65620,"Waldbrunn (Westerwald)"]
[null,null,null,null,null,533017,"Weilburg, St.","An den","Magistrat","der Stadt Weilburg","Mauerstraße 6-8",35781,"Weilburg"]
[null,null,null,null,null,533018,"Weilmünster, Marktflecken","An den","Gemeindevorstand","des Marktfleckens Weilmünster","Rathausplatz 8",35789,"Weilmünster"]
[null,null,null,null,null,533019,"Weinbach","An den","Gemeindevorstand","der Gemeinde Weinbach","Elkerhäuser Straße 17",35796,"Weinbach"]
[null,null,null,null,null,534001,"Amöneburg, St.","An den","Magistrat","der Stadt Amöneburg","Am Markt 1",35287,"Amöneburg"]
[null,null,null,null,null,534002,"Angelburg","An den","Gemeindevorstand","der Gemeinde Angelburg","Bahnhofstraße 1",35719,"Angelburg"]
[null,null,null,null,null,534003,"Bad Endbach","An den","Gemeindevorstand","der Gemeinde Bad Endbach","Herborner Straße 1",35080,"Bad Endbach"]
[null,null,null,null,null,534004,"Biedenkopf, St.","An den","Magistrat","der Stadt Biedenkopf","Hainstraße 63",35216,"Biedenkopf"]
[null,null,null,null,null,534005,"Breidenbach","An den","Gemeindevorstand","der Gemeinde Breidenbach","Bachstraße 4-14",35236,"Breidenbach"]
[null,null,null,null,null,534006,"Cölbe","An den","Gemeindevorstand","der Gemeinde Cölbe","Kasseler Straße 88",35091,"Cölbe"]
[null,null,null,null,null,534007,"Dautphetal","An den","Gemeindevorstand","der Gemeinde Dautphetal","Hainstraße 1",35232,"Dautphetal"]
[null,null,null,null,null,534008,"Ebsdorfergrund","An den","Gemeindevorstand","der Gemeinde Ebsdorfergrund","Dreihäuser Straße 17",35085,"Ebsdorfergrund"]
[null,null,null,null,null,534009,"Fronhausen","An den","Gemeindevorstand","der Gemeinde Fronhausen","Schulstraße 19",35112,"Fronhausen"]
[null,null,null,null,null,534010,"Gladenbach, St.","An den","Magistrat","der Stadt Gladenbach","Karl-Waldschmidt-Straße 3",35075,"Gladenbach"]
[null,null,null,null,null,534011,"Kirchhain, St.","An den","Magistrat","der Stadt Kirchhain","Am Markt  6-8",35274,"Kirchhain"]
[null,null,null,null,null,534012,"Lahntal","An den","Gemeindevorstand","der Gemeinde Lahntal","Oberdorfer Straße 1",35094,"Lahntal"]
[null,null,null,null,null,534013,"Lohra","An den","Gemeindevorstand","der Gemeinde Lohra","Heinrich-Naumann-Weg 2",35102,"Lohra"]
[null,null,null,null,null,534014,"Marburg, Universitätsstadt","An den","Magistrat","der Universitätsstadt Marburg","Markt 1",35037,"Marburg"]
[null,null,null,null,null,534015,"Münchhausen","An den","Gemeindevorstand","der Gemeinde Münchhausen","Marburger Straße 82",35117,"Münchhausen"]
[null,null,null,null,null,534016,"Neustadt (Hessen), St.","An den","Magistrat","der Stadt Neustadt","Ritterstraße 5",35279,"Neustadt (Hessen)"]
[null,null,null,null,null,534017,"Rauschenberg, St.","An den","Magistrat","der Stadt Rauschenberg","Schlossstraße 1",35282,"Rauschenberg"]
[null,null,null,null,null,534018,"Stadtallendorf, St.","An den","Magistrat","der Stadt Stadtallendorf","Bahnhofstraße 2",35260,"Stadtallendorf"]
[null,null,null,null,null,534019,"Steffenberg","An den","Gemeindevorstand","der Gemeinde Steffenberg","Bauhofstraße 1",35239,"Steffenberg"]
[null,null,null,null,null,534020,"Weimar (Lahn)","An den","Gemeindevorstand","der Gemeinde Weimar","Alte Bahnhofstraße 31",35096,"Weimar (Lahn)"]
[null,null,null,null,null,534021,"Wetter (Hessen), St.","An den","Magistrat","der Stadt Wetter","Marktplatz 1",35083,"Wetter (Hessen)"]
[null,null,null,null,null,534022,"Wohratal","An den","Gemeindevorstand","der Gemeinde Wohratal","Halsdorfer Straße 56",35288,"Wohratal"]
[null,null,null,null,null,535001,"Alsfeld, St.","An den","Magistrat","der Stadt Alsfeld","Markt 1",36304,"Alsfeld"]
[null,null,null,null,null,535002,"Antrifttal","An den","Gemeindevorstand","der Gemeinde Antrifttal","Weihersweg 24",36326,"Antrifttal"]
[null,null,null,null,null,535003,"Feldatal","An den","Gemeindevorstand","der Gemeinde Feldatal","Schulstraße 2",36325,"Feldatal"]
[null,null,null,null,null,535004,"Freiensteinau","An den","Gemeindevorstand","der Gemeinde Freiensteinau","Alte Schulstraße 5",36399,"Freiensteinau"]
[null,null,null,null,null,535005,"Gemünden (Felda)","An den","Gemeindevorstand","der Gemeinde Gemünden","Rathausgasse 6",35329,"Gemünden (Felda)"]
[null,null,null,null,null,535006,"Grebenau, St.","An den","Magistrat","der Stadt Grebenau","Amthof 2",36323,"Grebenau"]
[null,null,null,null,null,535007,"Grebenhain","An den","Gemeindevorstand","der Gemeinde Grebenhain","Hauptstraße 51",36355,"Grebenhain"]
[null,null,null,null,null,535008,"Herbstein, St.","An den","Magistrat","der Stadt Herbstein","Marktplatz 7",36358,"Herbstein"]
[null,null,null,null,null,535009,"Homberg (Ohm), St.","An den","Magistrat","der Stadt Homberg","Marktstraße 26",35315,"Homberg (Ohm)"]
[null,null,null,null,null,535010,"Kirtorf, St.","An den","Magistrat","der Stadt Kirtorf","Neustädter Straße 10-12",36320,"Kirtorf"]
[null,null,null,null,null,535011,"Lauterbach (Hessen), Kreisstadt","An den","Magistrat","der Kreisstadt Lauterbach","Marktplatz 14",36341,"Lauterbach (Hessen)"]
[null,null,null,null,null,535012,"Lautertal (Vogelsberg)","An den","Gemeindevorstand","der Gemeinde Lautertal","Rathausstraße 3",36369,"Lautertal (Vogelsberg)"]
[null,null,null,null,null,535013,"Mücke","An den","Gemeindevorstand","der Gemeinde Mücke","Im Herrnhain 2",35325,"Mücke"]
[null,null,null,null,null,535014,"Romrod, St.","An den","Magistrat","der Stadt Romrod","Jahnstraße 2",36329,"Romrod"]
[null,null,null,null,null,535015,"Schlitz, St.","An den","Magistrat","der Stadt Schlitz","An der Kirche 4",36110,"Schlitz"]
[null,null,null,null,null,535016,"Schotten, St.","An den","Magistrat","der Stadt Schotten","Vogelsbergstraße 184",63679,"Schotten"]
[null,null,null,null,null,535017,"Schwalmtal","An den","Gemeindevorstand","der Gemeinde Schwalmtal","Alsfelder Straße 72",36318,"Schwalmtal"]
[null,null,null,null,null,535018,"Ulrichstein, St.","An den","Magistrat","der Stadt Ulrichstein","Hauptstraße 9",35327,"Ulrichstein"]
[null,null,null,null,null,535019,"Wartenberg","An den","Gemeindevorstand","der Gemeinde Wartenberg","Landenhäuser Straße 11",36367,"Wartenberg"]
[null,null,null,null,null,631001,"Bad Salzschlirf","An den","Gemeindevorstand","der Gemeinde Bad Salzschlirf","Fuldaer Straße 2",36364,"Bad Salzschlirf "]
[null,null,null,null,null,631002,"Burghaun","An den","Gemeindevorstand","der Marktgemeinde Burghaun","Schlossstraße 15",36151,"Burghaun"]
[null,null,null,null,null,631003,"Dipperz","An den","Gemeindevorstand","der Gemeinde Dipperz","Am Dorfbrunnen 2",36160,"Dipperz"]
[null,null,null,null,null,631004,"Ebersburg","An den","Gemeindevorstand","der Gemeinde Ebersburg","Schulstraße 3",36157,"Ebersburg"]
[null,null,null,null,null,631005,"Ehrenberg (Rhön)","An den","Gemeindevorstand","der Gemeinde Ehrenberg","Rhönstraße 26",36115,"Ehrenberg (Rhön)"]
[null,null,null,null,null,631006,"Eichenzell","An den","Gemeindevorstand","der Gemeinde Eichenzell","Schlossgasse 4",36124,"Eichenzell"]
[null,null,null,null,null,631007,"Eiterfeld","An den","Gemeindevorstand","der Marktgemeinde Eiterfeld","Fürstenecker Straße 2",36132,"Eiterfeld"]
[null,null,null,null,null,631008,"Flieden","An den","Gemeindevorstand","der Gemeinde Flieden","Hauptstraße 36",36103,"Flieden"]
[null,null,null,null,null,631009,"Fulda, St.","An den","Magistrat","der Stadt Fulda","Schlossstraße 1",36037,"Fulda"]
[null,null,null,null,null,631010,"Gersfeld (Rhön), St.","An den","Magistrat","der Stadt Gersfeld","Marktplatz 19",36129,"Gersfeld (Rhön)"]
[null,null,null,null,null,631011,"Großenlüder","An den","Gemeindevorstand","der Gemeinde Großenlüder","St.-Georg-Straße 2",36137,"Großenlüder"]
[null,null,null,null,null,631012,"Hilders","An den","Gemeindevorstand","der Gemeinde Hilders","Kirchstraße 2-6",36115,"Hilders"]
[null,null,null,null,null,631013,"Hofbieber","An den","Gemeindevorstand","der Gemeinde Hofbieber","Schulweg 5",36145,"Hofbieber "]
[null,null,null,null,null,631014,"Hosenfeld","An den","Gemeindevorstand","der Gemeinde Hosenfeld","Kirchpfad 1",36154,"Hosenfeld"]
[null,null,null,null,null,631015,"Hünfeld, Konrad-Zuse-Stadt","An den","Magistrat","der Konrad-Zuse-Stadt Hünfeld","Konrad-Adenauer-Platz 1",36088,"Hünfeld"]
[null,null,null,null,null,631016,"Kalbach","An den","Gemeindevorstand","der Gemeinde Kalbach","Hauptstraße 12",36148,"Kalbach"]
[null,null,null,null,null,631017,"Künzell","An den","Gemeindevorstand","der Gemeinde Künzell","Unterer Ortesweg 23",36093,"Künzell"]
[null,null,null,null,null,631018,"Neuhof","An den","Gemeindevorstand","der Gemeinde Neuhof","Lindenplatz 4",36119,"Neuhof"]
[null,null,null,null,null,631019,"Nüsttal","An den","Gemeindevorstand","der Gemeinde Nüsttal","Schulstraße 19",36167,"Nüsttal"]
[null,null,null,null,null,631020,"Petersberg","An den","Gemeindevorstand","der Gemeinde Petersberg","Rathausplatz 1",36100,"Petersberg"]
[null,null,null,null,null,631021,"Poppenhausen (Wasserkuppe)","An den","Gemeindevorstand","der Gemeinde Poppenhausen","Von-Steinrück-Platz 1",36163,"Poppenhausen (Wasserkuppe)"]
[null,null,null,null,null,631022,"Rasdorf","An den","Gemeindevorstand","der Gemeinde Rasdorf","Am Anger 32",36169,"Rasdorf"]
[null,null,null,null,null,631023,"Tann (Rhön), St.","An den","Magistrat","der Stadt Tann","Marktplatz 9",36142,"Tann (Rhön)"]
[null,null,null,null,null,632001,"Alheim","An den","Gemeindevorstand","der Gemeinde Alheim","Alheimer Straße 2",36211,"Alheim"]
[null,null,null,null,null,632002,"Bad Hersfeld, Kreisstadt","An den","Magistrat","der Kreisstadt Bad Hersfeld","Weinstraße 16",36251,"Bad Hersfeld"]
[null,null,null,null,null,632003,"Bebra, St.","An den","Magistrat","der Stadt Bebra","Rathausmarkt 1",36179,"Bebra"]
[null,null,null,null,null,632004,"Breitenbach am Herzberg","An den","Gemeindevorstand","der Gemeinde Breitenbach","Machtloser Straße 5",36287,"Breitenbach a. Herzberg"]
[null,null,null,null,null,632005,"Cornberg","An den","Gemeindevorstand","der Gemeinde Cornberg","Am Markt 8",36219,"Cornberg"]
[null,null,null,null,null,632006,"Friedewald","An den","Gemeindevorstand","der Gemeinde Friedewald","Motzfelder Straße 12",36289,"Friedewald"]
[null,null,null,null,null,632007,"Hauneck","An den","Gemeindevorstand","der Gemeinde Hauneck","Hersfelder Straße 14",36282,"Hauneck"]
[null,null,null,null,null,632008,"Haunetal","An den","Gemeindevorstand","der Gemeinde Haunetal","Konrad-Zuse-Platz 6",36166,"Haunetal"]
[null,null,null,null,null,632009,"Heringen (Werra), St.","An den","Magistrat","der Stadt Heringen","Obere Goethestraße 17",36266,"Heringen (Werra)"]
[null,null,null,null,null,632010,"Hohenroda","An den","Gemeindevorstand","der Gemeinde Hohenroda","Schlossstraße 45",36284,"Hohenroda"]
[null,null,null,null,null,632011,"Kirchheim","An den","Gemeindevorstand","der Gemeinde Kirchheim","Hauptstraße 20",36275,"Kirchheim"]
[null,null,null,null,null,632012,"Ludwigsau","An den","Gemeindevorstand","der Gemeinde Ludwigsau","Schulstraße 1",36251,"Ludwigsau"]
[null,null,null,null,null,632013,"Nentershausen","An den","Gemeindevorstand","der Gemeinde Nentershausen","Burgstraße 2",36214,"Nentershausen"]
[null,null,null,null,null,632014,"Neuenstein","An den","Gemeindevorstand","der Gemeinde Neuenstein","Freiherr-vom-Stein-Straße 5",36286,"Neuenstein"]
[null,null,null,null,null,632015,"Niederaula","An den","Gemeindevorstand","der Marktgemeinde Niederaula","Schlitzer Straße 3",36272,"Niederaula"]
[null,null,null,null,null,632016,"Philippsthal (Werra)","An den","Gemeindevorstand","der Marktgemeinde Philippsthal","Schloss 1",36269,"Philippsthal (Werra)"]
[null,null,null,null,null,632017,"Ronshausen","An den","Gemeindevorstand","der Gemeinde Ronshausen","Eisenacher Straße 12a",36217,"Ronshausen"]
[null,null,null,null,null,632018,"Rotenburg a.d. Fulda, St.","An den","Magistrat","der Stadt Rotenburg","Marktplatz 15",36199,"Rotenburg a.d. Fulda"]
[null,null,null,null,null,632019,"Schenklengsfeld","An den","Gemeindevorstand","der Gemeinde Schenklengsfeld","Rathausstraße  2",36277,"Schenklengsfeld"]
[null,null,null,null,null,632020,"Wildeck","An den","Gemeindevorstand","der Gemeinde Wildeck","Eisenacher Straße 98",36208,"Wildeck"]
[null,null,null,null,null,633001,"Ahnatal","An den","Gemeindevorstand","der Gemeinde Ahnatal","Wilhelmsthaler Straße 3",34292,"Ahnatal"]
[null,null,null,null,null,633002,"Bad Karlshafen, St.","An den","Magistrat","der Stadt Bad Karlshafen","Hafenplatz 8",34385,"Bad Karlshafen"]
[null,null,null,null,null,633003,"Baunatal, St.","An den","Magistrat","der Stadt Baunatal","Marktplatz 14",34225,"Baunatal"]
[null,null,null,null,null,633004,"Breuna","An den","Gemeindevorstand","der Gemeinde Breuna","Volkmarser Straße 3",34479,"Breuna"]
[null,null,null,null,null,633005,"Calden","An den","Gemeindevorstand","der Gemeinde Calden","Holländische Straße 35",34379,"Calden"]
[null,null,null,null,null,633006,"Bad Emstal","An den","Gemeindevorstand","der Gemeinde Bad Emstal","Kasseler Straße 57",34308,"Bad Emstal"]
[null,null,null,null,null,633007,"Espenau","An den","Gemeindevorstand","der Gemeinde Espenau","Im Ort 1",34314,"Espenau"]
[null,null,null,null,null,633008,"Fuldabrück","An den","Gemeindevorstand","der Gemeinde Fuldabrück","Glockenhofsweg 3",34277,"Fuldabrück"]
[null,null,null,null,null,633009,"Fuldatal","An den","Gemeindevorstand","der Gemeinde Fuldatal","Am Rathaus 9",34233,"Fuldatal"]
[null,null,null,null,null,633010,"Grebenstein, St.","An den","Magistrat","der Stadt Grebenstein","Markt 1",34393,"Grebenstein"]
[null,null,null,null,null,633011,"Habichtswald","An den","Gemeindevorstand","der Gemeinde Habichtswald","Breiter Weg 4",34317,"Habichtswald"]
[null,null,null,null,null,633012,"Helsa","An den","Gemeindevorstand","der Gemeinde Helsa","Berliner Straße 20",34298,"Helsa"]
[null,null,null,null,null,633013,"Hofgeismar, St.","An den","Magistrat","der Stadt Hofgeismar","Markt 1",34369,"Hofgeismar"]
[null,null,null,null,null,633014,"Immenhausen, St.","An den","Magistrat","der Stadt Immenhausen","Marktplatz 1",34376,"Immenhausen"]
[null,null,null,null,null,633015,"Kaufungen","An den","Gemeindevorstand","der Gemeinde Kaufungen","Leipziger Straße 463",34260,"Kaufungen"]
[null,null,null,null,null,633016,"Liebenau, St.","An den","Magistrat","der Stadt Liebenau","Lacheweg 1",34396,"Liebenau"]
[null,null,null,null,null,633017,"Lohfelden","An den","Gemeindevorstand","der Gemeinde Lohfelden","Lange Straße 20",34253,"Lohfelden"]
[null,null,null,null,null,633018,"Naumburg, St.","An den","Magistrat","der Stadt Naumburg","Burgstraße 15",34311,"Naumburg"]
[null,null,null,null,null,633019,"Nieste","An den","Gemeindevorstand","der Gemeinde Nieste","Wilhelm-Heitmann-Platz 3",34329,"Nieste"]
[null,null,null,null,null,633020,"Niestetal","An den","Gemeindevorstand","der Gemeinde Niestetal","Heiligenröder Straße 70",34266,"Niestetal"]
[null,null,null,null,null,633021,"Oberweser","An den","Gemeindevorstand","der Gemeinde Oberweser","Brückenstraße 1",34399,"Oberweser"]
[null,null,null,null,null,633022,"Reinhardshagen","An den","Gemeindevorstand","der Gemeinde Reinhardshagen","Amtsstraße 10",34359,"Reinhardshagen"]
[null,null,null,null,null,633023,"Schauenburg","An den","Gemeindevorstand","der Gemeinde Schauenburg","Korbacher Straße 300",34270,"Schauenburg"]
[null,null,null,null,null,633024,"Söhrewald","An den","Gemeindevorstand","der Gemeinde Söhrewald","Schulstraße 8",34320,"Söhrewald"]
[null,null,null,null,null,633025,"Trendelburg, St.","An den","Magistrat","der Stadt Trendelburg","Marktplatz 1",34388,"Trendelburg"]
[null,null,null,null,null,633026,"Vellmar, St.","An den","Magistrat","der Stadt Vellmar","Rathausplatz 1",34246,"Vellmar"]
[null,null,null,null,null,633027,"Wahlsburg","An den","Gemeindevorstand","der Gemeinde Wahlsburg","Am Mühlbach 15",37194,"Wahlsburg"]
[null,null,null,null,null,633028,"Wolfhagen, St.","An den","Magistrat","der Stadt Wolfhagen","Burgstraße 33-35",34466,"Wolfhagen"]
[null,null,null,null,null,633029,"Zierenberg, St.","An den","Magistrat","der Stadt Zierenberg","Poststraße 20",34289,"Zierenberg"]
[null,null,null,null,null,634001,"Borken (Hessen), St.","An den","Magistrat","der Stadt Borken","Am Rathaus 7",34582,"Borken (Hessen)"]
[null,null,null,null,null,634002,"Edermünde","An den","Gemeindevorstand","der Gemeinde Edermünde","Brückenhofstraße 4",34295,"Edermünde"]
[null,null,null,null,null,634003,"Felsberg, St.","An den","Magistrat","der Stadt Felsberg","Vernouillet-Allee 1",34587,"Felsberg"]
[null,null,null,null,null,634004,"Frielendorf","An den","Gemeindevorstand","der Gemeinde Frielendorf","Ziegenhainer Straße 2",34621,"Frielendorf"]
[null,null,null,null,null,634005,"Fritzlar, Dom- u. Kaiserstadt","An den","Magistrat","der Dom- und Kaiserstadt Fritzlar","Zwischen den Krämen 7",34560,"Fritzlar"]
[null,null,null,null,null,634006,"Gilserberg","An den","Gemeindevorstand","der Gemeinde Gilserberg","Bahnhofstraße 40",34630,"Gilserberg"]
[null,null,null,null,null,634007,"Gudensberg, St.","An den","Magistrat","der Stadt Gudensberg","Kasseler Straße 2",34281,"Gudensberg"]
[null,null,null,null,null,634008,"Guxhagen","An den","Gemeindevorstand","der Gemeinde Guxhagen","Zum Ehrenhain 2",34302,"Guxhagen"]
[null,null,null,null,null,634009,"Homberg (Efze), Kreisstadt","An den","Magistrat","der Kreisstadt Homberg","Rathausgasse 1",34576,"Homberg (Efze)"]
[null,null,null,null,null,634010,"Jesberg","An den","Gemeindevorstand","der Gemeinde Jesberg","Frankfurter Straße 1",34632,"Jesberg"]
[null,null,null,null,null,634011,"Knüllwald","An den","Gemeindevorstand","der Gemeinde Knüllwald","Hauptstraße 7",34593,"Knüllwald"]
[null,null,null,null,null,634012,"Körle","An den","Gemeindevorstand","der Gemeinde Körle","Im Mülmischtal 2",34327,"Körle"]
[null,null,null,null,null,634013,"Malsfeld","An den","Gemeindevorstand","der Gemeinde Malsfeld","Lindenstraße 1",34323,"Malsfeld"]
[null,null,null,null,null,634014,"Melsungen, St.","An den","Magistrat","der Stadt Melsungen","Am Markt 1",34212,"Melsungen"]
[null,null,null,null,null,634015,"Morschen","An den","Gemeindevorstand","der Gemeinde Morschen","Paul-Frankfurth-Str. 11",34326,"Morschen"]
[null,null,null,null,null,634016,"Neuental","An den","Gemeindevorstand","der Gemeinde Neuental","Hauptstraße  8",34599,"Neuental"]
[null,null,null,null,null,634017,"Neukirchen, St.","An den","Magistrat","der Stadt Neukirchen","Am Rathaus 10",34626,"Neukirchen"]
[null,null,null,null,null,634018,"Niedenstein, St.","An den","Magistrat","der Stadt Niedenstein","Obertor 8",34305,"Niedenstein"]
[null,null,null,null,null,634019,"Oberaula","An den","Gemeindevorstand","der Gemeinde Oberaula","Hersfelder Straße 4",36280,"Oberaula"]
[null,null,null,null,null,634020,"Ottrau","An den","Gemeindevorstand","der Gemeinde Ottrau","Neukirchener Straße 1",34633,"Ottrau"]
[null,null,null,null,null,634021,"Schrecksbach","An den","Gemeindevorstand","der Gemeinde Schrecksbach","Immichenhainer Straße 1",34637,"Schrecksbach"]
[null,null,null,null,null,634022,"Schwalmstadt, St.","An den","Magistrat","der Stadt Schwalmstadt","Marktplatz 1",34613,"Schwalmstadt"]
[null,null,null,null,null,634023,"Schwarzenborn, St.","An den","Magistrat","der Stadt Schwarzenborn","Marktplatz 1",34639,"Schwarzenborn"]
[null,null,null,null,null,634024,"Spangenberg, Liebenbachst.","An den","Magistrat","der Liebenbachstadt Spangenberg","Marktplatz 1",34286,"Spangenberg"]
[null,null,null,null,null,634025,"Wabern","An den","Gemeindevorstand","der Gemeinde Wabern","Landgrafenstraße 9",34590,"Wabern"]
[null,null,null,null,null,634026,"Willingshausen","An den","Gemeindevorstand","der Gemeinde Willingshausen","Am Rathaus 2",34628,"Willingshausen"]
[null,null,null,null,null,634027,"Bad Zwesten","An den","Gemeindevorstand","der Gemeinde Bad Zwesten","Ringstraße 1",34596,"Bad Zwesten"]
[null,null,null,null,null,635001,"Allendorf (Eder)","An den","Gemeindevorstand","der Gemeinde Allendorf","Schulstraße 5",35108,"Allendorf (Eder)"]
[null,null,null,null,null,635002,"Bad Arolsen, St.","An den","Magistrat","der Stadt Bad Arolsen","Große Allee 26",34454,"Bad Arolsen"]
[null,null,null,null,null,635003,"Bad Wildungen, St.","An den","Magistrat","der Stadt Bad Wildungen","Am Markt 1",34537,"Bad Wildungen"]
[null,null,null,null,null,635004,"Battenberg (Eder), St.","An den","Magistrat","der Stadt Battenberg","Hauptstraße 58",35088,"Battenberg (Eder)"]
[null,null,null,null,null,635005,"Bromskirchen","An den","Gemeindevorstand","der Gemeinde Bromskirchen","Unterm Stein 2",59969,"Bromskirchen"]
[null,null,null,null,null,635006,"Burgwald","An den","Gemeindevorstand","der Gemeinde Burgwald","Hauptstraße 73",35099,"Burgwald"]
[null,null,null,null,null,635007,"Diemelsee","An den","Gemeindevorstand","der Gemeinde Diemelsee","Am Kahlenberg 1",34519,"Diemelsee"]
[null,null,null,null,null,635008,"Diemelstadt, St.","An den","Magistrat","der Stadt Diemelstadt","Lange Straße 6",34474,"Diemelstadt"]
[null,null,null,null,null,635009,"Edertal","An den","Gemeindevorstand","der Gemeinde Edertal","Bahnhofstraße 25",34549,"Edertal"]
[null,null,null,null,null,635010,"Frankenau, St.","An den","Magistrat","der Stadt Frankenau","Ehlingshäuser Straße 1",35110,"Frankenau"]
[null,null,null,null,null,635011,"Frankenberg (Eder), St.","An den","Magistrat","der Stadt Frankenberg","Obermarkt 7-13",35066,"Frankenberg (Eder)"]
[null,null,null,null,null,635012,"Gemünden (Wohra), St.","An den","Magistrat","der Stadt Gemünden","Marktstraße 10",35285,"Gemünden (Wohra)"]
[null,null,null,null,null,635013,"Haina (Kloster)","An den","Gemeindevorstand","der Gemeinde Haina","Poststraße 4",35114,"Haina (Kloster)"]
[null,null,null,null,null,635014,"Hatzfeld (Eder), St.","An den","Magistrat","der Stadt Hatzfeld","Im Hain 1",35116,"Hatzfeld (Eder)"]
[null,null,null,null,null,635015,"Korbach, Hansestadt, Krst.","An den","Magistrat","der Kreis- und Hansestadt Korbach","Stechbahn 1",34497,"Korbach"]
[null,null,null,null,null,635016,"Lichtenfels, St.","An den","Magistrat","der Stadt Lichtenfels","Aarweg 10",35104,"Lichtenfels"]
[null,null,null,null,null,635017,"Rosenthal, St.","An den","Magistrat","der Stadt Rosenthal","Am Rathaus 2",35119,"Rosenthal"]
[null,null,null,null,null,635018,"Twistetal","An den","Gemeindevorstand","der Gemeinde Twistetal","Hüfte 7",34477,"Twistetal"]
[null,null,null,null,null,635019,"Vöhl","An den","Gemeindevorstand","der Gemeinde Vöhl","Schlossstraße 1",34516,"Vöhl"]
[null,null,null,null,null,635020,"Volkmarsen, St.","An den","Magistrat","der Stadt Volkmarsen","Steinweg 29",34471,"Volkmarsen"]
[null,null,null,null,null,635021,"Waldeck, St.","An den","Magistrat","der Stadt Waldeck","Am Rathaus 1",34513,"Waldeck"]
[null,null,null,null,null,635022,"Willingen (Upland)","An den","Gemeindevorstand","der Gemeinde Willingen","Waldecker Straße 12",34508,"Willingen (Upland)"]
[null,null,null,null,null,636001,"Bad Sooden-Allendorf, St.","An den","Magistrat","der Stadt Bad Sooden-Allendorf","Marktplatz 8",37242,"Bad Sooden-Allendorf"]
[null,null,null,null,null,636002,"Berkatal","An den","Gemeindevorstand","der Gemeinde Berkatal","Berkastraße 54",37297,"Berkatal"]
[null,null,null,null,null,636003,"Eschwege, Kreisstadt","An den","Magistrat","der Kreisstadt Eschwege","Obermarkt 22",37269,"Eschwege"]
[null,null,null,null,null,636004,"Großalmerode, St.","An den","Magistrat","der Stadt Großalmerode","Marktplatz 11",37247,"Großalmerode"]
[null,null,null,null,null,636005,"Herleshausen","An den","Gemeindevorstand","der Gemeinde Herleshausen","Bahnhofstraße 15",37293,"Herleshausen"]
[null,null,null,null,null,636006,"Hessisch Lichtenau, St.","An den","Magistrat","der Stadt Hessisch Lichtenau","Landgrafenstraße 52",37235,"Hessisch Lichtenau"]
[null,null,null,null,null,636007,"Meinhard","An den","Gemeindevorstand","der Gemeinde Meinhard","Sandstraße 15",37276,"Meinhard-Grebendorf"]
[null,null,null,null,null,636008,"Meißner","An den","Gemeindevorstand","der Gemeinde Meißner","Hinterweg 4",37290,"Meißner"]
[null,null,null,null,null,636009,"Neu-Eichenberg","An den","Gemeindevorstand","der Gemeinde Neu-Eichenberg","Kirchstraße 2",37249,"Neu-Eichenberg"]
[null,null,null,null,null,636010,"Ringgau","An den","Gemeindevorstand","der Gemeinde Ringgau","Am Anger 3",37296,"Ringgau"]
[null,null,null,null,null,636011,"Sontra, St.","An den","Magistrat","der Stadt Sontra","Marktplatz 6",36205,"Sontra"]
[null,null,null,null,null,636012,"Waldkappel, St.","An den","Magistrat","der Stadt Waldkappel","Leipziger Straße 34",37284,"Waldkappel"]
[null,null,null,null,null,636013,"Wanfried, St.","An den","Magistrat","der Stadt Wanfried","Marktstraße 18",37281,"Wanfried"]
[null,null,null,null,null,636014,"Wehretal","An den","Gemeindevorstand","der Gemeinde Wehretal","Platz der Normandie 1",37287,"Wehretal"]
[null,null,null,null,null,636015,"Weißenborn","An den","Gemeindevorstand","der Gemeinde Weißenborn","Kirchplatz 1",37299,"Weißenborn"]
[null,null,null,null,null,636016,"Witzenhausen, St.","An den","Magistrat","der Stadt Witzenhausen","Am Markt 1",37213,"Witzenhausen"]

{"sheet":"Einstellungen","index":10,"n_rows":44,"n_cols":1,"rows_kept":44,"cut":false,"hidden":false,"merged":[]}
[]
["Arbeitshilfe Formular"]
[]
["Hohe Sicherheitseinstellungen können dazu führen, dass Dateien mit Makros nicht geöffnet oder bearbeitet werden können."]
["Sofern dies zu Problemen mit den Anmeldeformularen führt, kann die Speicherung der jeweiligen Datei als „xlsx-Datei“ erfolgen."]
[]
[]
[]
[]
[]
[]
[]
[]
[]
[]
[]
[]
[]
[]
[]
[]
[]
[]
[]
[]
[]
[]
[]
[]
[]
[]
[]
[]
[]
[]
[]
[]
[]
[]
[]
[]
[]
[]
["Alternativ ist auch das Abspeichern des Formulars auf einem anderen Datenträger (z. Bsp. CD oder USB-Stick) und dessen Versand auf dem Postweg möglich."]

{"sheet":"Tabelle1","index":11,"n_rows":18,"n_cols":1,"rows_kept":18,"cut":false,"hidden":true,"merged":[]}
["'Kommentare formatieren"]
[" Sub KommentareAnpassen()"]
[" Dim Kom As Comment"]
["    For Each Com In ActiveSheet.Comments"]
["        Kom.Shape.TextFrame.AutoSize = True"]
["        Next Kom"]
["       End Sub"]
[]
["'Kommentare an Textgröße anpassen"]
[" Sub KommentareFormatieren()"]
[" Dim Kom As Comment"]
["    For Each Com In ActiveSheet.Comments"]
["    With Kom.Shape.TextFrame.Characters.Font"]
["    .Name = \"Arial\""]
["    .Size = 10"]
["    End With"]
["        Next Kom"]
["       End Sub"]

{"sheet":"LK mit Kommunen","index":12,"n_rows":184,"n_cols":180,"rows_kept":184,"cut":false,"hidden":true,"merged":[]}
[null,null,1,"GKZ",null,null,null,null,null,null,null,"06437000","06531000"]
[6437000,"Odenwaldkreis",2,"06437000","LK Odenwald",null,6412000,"LANDKREIS FULDA"]
[6531000,"Kreis Gießen",3,"06437001","Bad König",null,6413000,"LANDKREIS WALDECK-FRANKENBERG"]
[6533000,"Kreis Limburg-Weilburg",4,"06437002","Beerfelden     ",null,6431000,"LANDKREIS LIMBURG-WEILBURG",null,null,null,"LK Odenwald"]
[6535000,"Vogelsbergkreis",5,"06437003","Brensbach",null,6431001,"LANDKREIS GIESSEN",null,null,null,"LK Gießen"]
[6631000,"Kreis Fulda",6,"06437004","Breuberg",null,6431003,"SCHWALM-EDER-KREIS",null,null,null,"Gesamtergebnis"]
[6634000,"Schwalm-Eder-Kreis",7,"06437005","Brombachtal",null,6431004,"ODENWALDKREIS"]
[6635000,"Kreis Waldeck-Frankenberg",8,"06437006","Erbach",null,6431010,"WERRA-MEISSNER-KREIS"]
[6636000,"Werra-Meißner-Kreis",9,"06437007","Fränkisch-Crumbach",null,6636009,"VOGELSBERGKREIS"]
[null,null,10,"06437008","Hesseneck"]
[null,null,11,"06437009","Höchst i.Odw."]
[null,null,12,"06437010","Lützelbach"]
[null,null,13,"06437011","Michelstadt"]
[null,null,14,"06437012","Mossautal"]
[null,null,15,"06437013","Reichelsheim (Odenwald)",null,null,null,null,null,null,"Summe von 1","GKZ"]
[null,null,16,"06437014","Rothenberg",null,null,null,null,null,null,"Kommune","06437000","06437001","06437002","06437003","06437004","06437005","06437006","06437007","06437008","06437009","06437010","06437011","06437012","06437013","06437014","06437015","06531000","06531001","06531002","06531003","06531004","06531005","06531006","06531007","06531008","06531009","06531010","06531011","06531012","06531013","06531014","06531015","06531016","06531017","06531018","06533000","06533001","06533002","06533003","06533004","06533005","06533006","06533007","06533008","06533009","06533010","06533011","06533012","06533013","06533014","06533015","06533016","06533017","06533018","06533019","06535000","06535001","06535002","06535003","06535004","06535005","06535006","06535007","06535008","06535009","06535010","06535011","06535012","06535013","06535014","06535015","06535016","06535017","06535018","06535019","06631000","06631001","06631002","06631003","06631004","06631005","06631006","06631007","06631008","06631009","06631010","06631011","06631012","06631013","06631014","06631015","06631016","06631017","06631018","06631019","06631020","06631021","06631022","06631023","06634000","06634001","06634002","06634003","06634004","06634005","06634006","06634007","06634008","06634009","06634010","06634011","06634012","06634013","06634014","06634015","06634016","06634017","06634018","06634019","06634020","06634021","06634022","06634023","06634024","06634025","06634026","06634027","06635000","06635001","06635002","06635003","06635004","06635005","06635006","06635007","06635008","06635009","06635010","06635011","06635012","06635013","06635014","06635015","06635016","06635017","06635018","06635019","06635020","06635021","06635022","06636000","06636001","06636002","06636003","06636004","06636005","06636006","06636007","06636008","06636009","06636010","06636011","06636012","06636013","06636014","06636015","06636016","Gesamtergebnis"]
[null,null,17,"06437015","Sensbachtal",null,null,null,null,null,null,"Allendorf (Eder)",null,null,null,null,null,null,null,null,null,null,null,null,null,null,null,null,null,null,null,null,null,null,null,null,null,null,null,null,null,null,null,null,null,null,null,null,null,null,null,null,null,null,null,null,null,null,null,null,null,null,null,null,null,null,null,null,null,null,null,null,null,null,null,null,null,null,null,null,null,null,null,null,null,null,null,null,null,null,null,null,null,null,null,null,null,null,null,null,null,null,null,null,null,null,null,null,null,null,null,null,null,null,null,null,null,null,null,null,null,null,null,null,null,null,null,null,null,null,null,null,null,null,null,null,null,null,null,null,130,null,null,null,null,null,null,null,null,null,null,null,null,null,null,null,null,null,null,null,null,null,null,null,null,null,null,null,null,null,null,null,null,null,null,null,null,null,null,130]
[null,null,18,"06531000","LK Gießen",null,null,null,null,null,null,"Allendorf (Lumda)",null,null,null,null,null,null,null,null,null,null,null,null,null,null,null,null,null,19,null,null,null,null,null,null,null,null,null,null,null,null,null,null,null,null,null,null,null,null,null,null,null,null,null,null,null,null,null,null,null,null,null,null,null,null,null,null,null,null,null,null,null,null,null,null,null,null,null,null,null,null,null,null,null,null,null,null,null,null,null,null,null,null,null,null,null,null,null,null,null,null,null,null,null,null,null,null,null,null,null,null,null,null,null,null,null,null,null,null,null,null,null,null,null,null,null,null,null,null,null,null,null,null,null,null,null,null,null,null,null,null,null,null,null,null,null,null,null,null,null,null,null,null,null,null,null,null,null,null,null,null,null,null,null,null,null,null,null,null,null,null,null,null,null,null,null,null,null,19]
[null,null,19,"06531001","Allendorf (Lumda)",null,null,null,null,null,null,"Alsfeld",null,null,null,null,null,null,null,null,null,null,null,null,null,null,null,null,null,null,null,null,null,null,null,null,null,null,null,null,null,null,null,null,null,null,null,null,null,null,null,null,null,null,null,null,null,null,null,null,null,null,null,null,null,null,null,null,58,null,null,null,null,null,null,null,null,null,null,null,null,null,null,null,null,null,null,null,null,null,null,null,null,null,null,null,null,null,null,null,null,null,null,null,null,null,null,null,null,null,null,null,null,null,null,null,null,null,null,null,null,null,null,null,null,null,null,null,null,null,null,null,null,null,null,null,null,null,null,null,null,null,null,null,null,null,null,null,null,null,null,null,null,null,null,null,null,null,null,null,null,null,null,null,null,null,null,null,null,null,null,null,null,null,null,null,null,null,null,58]
[null,null,20,"06531002","Biebertal",null,null,null,null,null,null,"Antrifttal",null,null,null,null,null,null,null,null,null,null,null,null,null,null,null,null,null,null,null,null,null,null,null,null,null,null,null,null,null,null,null,null,null,null,null,null,null,null,null,null,null,null,null,null,null,null,null,null,null,null,null,null,null,null,null,null,null,59,null,null,null,null,null,null,null,null,null,null,null,null,null,null,null,null,null,null,null,null,null,null,null,null,null,null,null,null,null,null,null,null,null,null,null,null,null,null,null,null,null,null,null,null,null,null,null,null,null,null,null,null,null,null,null,null,null,null,null,null,null,null,null,null,null,null,null,null,null,null,null,null,null,null,null,null,null,null,null,null,null,null,null,null,null,null,null,null,null,null,null,null,null,null,null,null,null,null,null,null,null,null,null,null,null,null,null,null,null,59]
[null,null,21,"06531003","Buseck",null,null,null,null,null,null,"Bad Arolsen",null,null,null,null,null,null,null,null,null,null,null,null,null,null,null,null,null,null,null,null,null,null,null,null,null,null,null,null,null,null,null,null,null,null,null,null,null,null,null,null,null,null,null,null,null,null,null,null,null,null,null,null,null,null,null,null,null,null,null,null,null,null,null,null,null,null,null,null,null,null,null,null,null,null,null,null,null,null,null,null,null,null,null,null,null,null,null,null,null,null,null,null,null,null,null,null,null,null,null,null,null,null,null,null,null,null,null,null,null,null,null,null,null,null,null,null,null,null,null,null,null,null,null,null,null,null,null,null,null,131,null,null,null,null,null,null,null,null,null,null,null,null,null,null,null,null,null,null,null,null,null,null,null,null,null,null,null,null,null,null,null,null,null,null,null,null,null,131]
[null,null,22,"06531004","Fernwald",null,null,null,null,null,null,"Bad Camberg",null,null,null,null,null,null,null,null,null,null,null,null,null,null,null,null,null,null,null,null,null,null,null,null,null,null,null,null,null,null,null,null,null,null,null,null,null,null,40,null,null,null,null,null,null,null,null,null,null,null,null,null,null,null,null,null,null,null,null,null,null,null,null,null,null,null,null,null,null,null,null,null,null,null,null,null,null,null,null,null,null,null,null,null,null,null,null,null,null,null,null,null,null,null,null,null,null,null,null,null,null,null,null,null,null,null,null,null,null,null,null,null,null,null,null,null,null,null,null,null,null,null,null,null,null,null,null,null,null,null,null,null,null,null,null,null,null,null,null,null,null,null,null,null,null,null,null,null,null,null,null,null,null,null,null,null,null,null,null,null,null,null,null,null,null,null,null,40]
[null,null,23,"06531005","Gießen",null,null,null,null,null,null,"Bad König",null,3,null,null,null,null,null,null,null,null,null,null,null,null,null,null,null,null,null,null,null,null,null,null,null,null,null,null,null,null,null,null,null,null,null,null,null,null,null,null,null,null,null,null,null,null,null,null,null,null,null,null,null,null,null,null,null,null,null,null,null,null,null,null,null,null,null,null,null,null,null,null,null,null,null,null,null,null,null,null,null,null,null,null,null,null,null,null,null,null,null,null,null,null,null,null,null,null,null,null,null,null,null,null,null,null,null,null,null,null,null,null,null,null,null,null,null,null,null,null,null,null,null,null,null,null,null,null,null,null,null,null,null,null,null,null,null,null,null,null,null,null,null,null,null,null,null,null,null,null,null,null,null,null,null,null,null,null,null,null,null,null,null,null,null,null,null,3]
[null,null,24,"06531006","Grünberg",null,null,null,null,null,null,"Bad Salzschlirf",null,null,null,null,null,null,null,null,null,null,null,null,null,null,null,null,null,null,null,null,null,null,null,null,null,null,null,null,null,null,null,null,null,null,null,null,null,null,null,null,null,null,null,null,null,null,null,null,null,null,null,null,null,null,null,null,null,null,null,null,null,null,null,null,null,null,null,null,null,null,null,null,null,null,null,null,78,null,null,null,null,null,null,null,null,null,null,null,null,null,null,null,null,null,null,null,null,null,null,null,null,null,null,null,null,null,null,null,null,null,null,null,null,null,null,null,null,null,null,null,null,null,null,null,null,null,null,null,null,null,null,null,null,null,null,null,null,null,null,null,null,null,null,null,null,null,null,null,null,null,null,null,null,null,null,null,null,null,null,null,null,null,null,null,null,null,null,78]
[null,null,25,"06531007","Heuchelheim",null,null,null,null,null,null,"Bad Sooden-Allendorf",null,null,null,null,null,null,null,null,null,null,null,null,null,null,null,null,null,null,null,null,null,null,null,null,null,null,null,null,null,null,null,null,null,null,null,null,null,null,null,null,null,null,null,null,null,null,null,null,null,null,null,null,null,null,null,null,null,null,null,null,null,null,null,null,null,null,null,null,null,null,null,null,null,null,null,null,null,null,null,null,null,null,null,null,null,null,null,null,null,null,null,null,null,null,null,null,null,null,null,null,null,null,null,null,null,null,null,null,null,null,null,null,null,null,null,null,null,null,null,null,null,null,null,null,null,null,null,null,null,null,null,null,null,null,null,null,null,null,null,null,null,null,null,null,null,null,null,null,null,null,null,153,null,null,null,null,null,null,null,null,null,null,null,null,null,null,null,153]
[null,null,26,"06531008","Hungen",null,null,null,null,null,null,"Bad Wildungen",null,null,null,null,null,null,null,null,null,null,null,null,null,null,null,null,null,null,null,null,null,null,null,null,null,null,null,null,null,null,null,null,null,null,null,null,null,null,null,null,null,null,null,null,null,null,null,null,null,null,null,null,null,null,null,null,null,null,null,null,null,null,null,null,null,null,null,null,null,null,null,null,null,null,null,null,null,null,null,null,null,null,null,null,null,null,null,null,null,null,null,null,null,null,null,null,null,null,null,null,null,null,null,null,null,null,null,null,null,null,null,null,null,null,null,null,null,null,null,null,null,null,null,null,null,null,null,null,null,null,132,null,null,null,null,null,null,null,null,null,null,null,null,null,null,null,null,null,null,null,null,null,null,null,null,null,null,null,null,null,null,null,null,null,null,null,null,132]
[null,null,27,"06531009","Langgöns",null,null,null,null,null,null,"Bad Zwesten",null,null,null,null,null,null,null,null,null,null,null,null,null,null,null,null,null,null,null,null,null,null,null,null,null,null,null,null,null,null,null,null,null,null,null,null,null,null,null,null,null,null,null,null,null,null,null,null,null,null,null,null,null,null,null,null,null,null,null,null,null,null,null,null,null,null,null,null,null,null,null,null,null,null,null,null,null,null,null,null,null,null,null,null,null,null,null,null,null,null,null,null,null,null,null,null,null,null,null,null,null,null,null,null,null,null,null,null,null,null,null,null,null,null,null,null,null,null,null,null,null,null,null,null,null,null,128,null,null,null,null,null,null,null,null,null,null,null,null,null,null,null,null,null,null,null,null,null,null,null,null,null,null,null,null,null,null,null,null,null,null,null,null,null,null,null,null,128]
[null,null,28,"06531010","Laubach",null,null,null,null,null,null,"Battenberg (Eder)",null,null,null,null,null,null,null,null,null,null,null,null,null,null,null,null,null,null,null,null,null,null,null,null,null,null,null,null,null,null,null,null,null,null,null,null,null,null,null,null,null,null,null,null,null,null,null,null,null,null,null,null,null,null,null,null,null,null,null,null,null,null,null,null,null,null,null,null,null,null,null,null,null,null,null,null,null,null,null,null,null,null,null,null,null,null,null,null,null,null,null,null,null,null,null,null,null,null,null,null,null,null,null,null,null,null,null,null,null,null,null,null,null,null,null,null,null,null,null,null,null,null,null,null,null,null,null,null,null,null,null,133,null,null,null,null,null,null,null,null,null,null,null,null,null,null,null,null,null,null,null,null,null,null,null,null,null,null,null,null,null,null,null,null,null,null,null,133]
[null,null,29,"06531011","Lich",null,null,null,null,null,null,"Beerfelden     ",null,null,4,null,null,null,null,null,null,null,null,null,null,null,null,null,null,null,null,null,null,null,null,null,null,null,null,null,null,null,null,null,null,null,null,null,null,null,null,null,null,null,null,null,null,null,null,null,null,null,null,null,null,null,null,null,null,null,null,null,null,null,null,null,null,null,null,null,null,null,null,null,null,null,null,null,null,null,null,null,null,null,null,null,null,null,null,null,null,null,null,null,null,null,null,null,null,null,null,null,null,null,null,null,null,null,null,null,null,null,null,null,null,null,null,null,null,null,null,null,null,null,null,null,null,null,null,null,null,null,null,null,null,null,null,null,null,null,null,null,null,null,null,null,null,null,null,null,null,null,null,null,null,null,null,null,null,null,null,null,null,null,null,null,null,null,null,4]
[null,null,30,"06531012","Linden",null,null,null,null,null,null,"Berkatal",null,null,null,null,null,null,null,null,null,null,null,null,null,null,null,null,null,null,null,null,null,null,null,null,null,null,null,null,null,null,null,null,null,null,null,null,null,null,null,null,null,null,null,null,null,null,null,null,null,null,null,null,null,null,null,null,null,null,null,null,null,null,null,null,null,null,null,null,null,null,null,null,null,null,null,null,null,null,null,null,null,null,null,null,null,null,null,null,null,null,null,null,null,null,null,null,null,null,null,null,null,null,null,null,null,null,null,null,null,null,null,null,null,null,null,null,null,null,null,null,null,null,null,null,null,null,null,null,null,null,null,null,null,null,null,null,null,null,null,null,null,null,null,null,null,null,null,null,null,null,null,null,154,null,null,null,null,null,null,null,null,null,null,null,null,null,null,154]
[null,null,31,"06531013","Lollar",null,null,null,null,null,null,"Beselich",null,null,null,null,null,null,null,null,null,null,null,null,null,null,null,null,null,null,null,null,null,null,null,null,null,null,null,null,null,null,null,null,null,null,null,null,38,null,null,null,null,null,null,null,null,null,null,null,null,null,null,null,null,null,null,null,null,null,null,null,null,null,null,null,null,null,null,null,null,null,null,null,null,null,null,null,null,null,null,null,null,null,null,null,null,null,null,null,null,null,null,null,null,null,null,null,null,null,null,null,null,null,null,null,null,null,null,null,null,null,null,null,null,null,null,null,null,null,null,null,null,null,null,null,null,null,null,null,null,null,null,null,null,null,null,null,null,null,null,null,null,null,null,null,null,null,null,null,null,null,null,null,null,null,null,null,null,null,null,null,null,null,null,null,null,null,null,38]
[null,null,32,"06531014","Pohlheim",null,null,null,null,null,null,"Biebertal",null,null,null,null,null,null,null,null,null,null,null,null,null,null,null,null,null,null,20,null,null,null,null,null,null,null,null,null,null,null,null,null,null,null,null,null,null,null,null,null,null,null,null,null,null,null,null,null,null,null,null,null,null,null,null,null,null,null,null,null,null,null,null,null,null,null,null,null,null,null,null,null,null,null,null,null,null,null,null,null,null,null,null,null,null,null,null,null,null,null,null,null,null,null,null,null,null,null,null,null,null,null,null,null,null,null,null,null,null,null,null,null,null,null,null,null,null,null,null,null,null,null,null,null,null,null,null,null,null,null,null,null,null,null,null,null,null,null,null,null,null,null,null,null,null,null,null,null,null,null,null,null,null,null,null,null,null,null,null,null,null,null,null,null,null,null,null,20]
[null,null,33,"06531015","Rabenau",null,null,null,null,null,null,"Borken (Hessen)",null,null,null,null,null,null,null,null,null,null,null,null,null,null,null,null,null,null,null,null,null,null,null,null,null,null,null,null,null,null,null,null,null,null,null,null,null,null,null,null,null,null,null,null,null,null,null,null,null,null,null,null,null,null,null,null,null,null,null,null,null,null,null,null,null,null,null,null,null,null,null,null,null,null,null,null,null,null,null,null,null,null,null,null,null,null,null,null,null,null,null,null,null,null,null,null,null,null,null,null,102,null,null,null,null,null,null,null,null,null,null,null,null,null,null,null,null,null,null,null,null,null,null,null,null,null,null,null,null,null,null,null,null,null,null,null,null,null,null,null,null,null,null,null,null,null,null,null,null,null,null,null,null,null,null,null,null,null,null,null,null,null,null,null,null,null,null,102]
[null,null,34,"06531016","Reiskirchen",null,null,null,null,null,null,"Brechen",null,null,null,null,null,null,null,null,null,null,null,null,null,null,null,null,null,null,null,null,null,null,null,null,null,null,null,null,null,null,null,null,null,null,null,null,null,39,null,null,null,null,null,null,null,null,null,null,null,null,null,null,null,null,null,null,null,null,null,null,null,null,null,null,null,null,null,null,null,null,null,null,null,null,null,null,null,null,null,null,null,null,null,null,null,null,null,null,null,null,null,null,null,null,null,null,null,null,null,null,null,null,null,null,null,null,null,null,null,null,null,null,null,null,null,null,null,null,null,null,null,null,null,null,null,null,null,null,null,null,null,null,null,null,null,null,null,null,null,null,null,null,null,null,null,null,null,null,null,null,null,null,null,null,null,null,null,null,null,null,null,null,null,null,null,null,null,39]
[null,null,35,"06531017","Staufenberg",null,null,null,null,null,null,"Brensbach",null,null,null,5,null,null,null,null,null,null,null,null,null,null,null,null,null,null,null,null,null,null,null,null,null,null,null,null,null,null,null,null,null,null,null,null,null,null,null,null,null,null,null,null,null,null,null,null,null,null,null,null,null,null,null,null,null,null,null,null,null,null,null,null,null,null,null,null,null,null,null,null,null,null,null,null,null,null,null,null,null,null,null,null,null,null,null,null,null,null,null,null,null,null,null,null,null,null,null,null,null,null,null,null,null,null,null,null,null,null,null,null,null,null,null,null,null,null,null,null,null,null,null,null,null,null,null,null,null,null,null,null,null,null,null,null,null,null,null,null,null,null,null,null,null,null,null,null,null,null,null,null,null,null,null,null,null,null,null,null,null,null,null,null,null,null,null,5]
[null,null,36,"06531018","Wettenberg",null,null,null,null,null,null,"Breuberg",null,null,null,null,6,null,null,null,null,null,null,null,null,null,null,null,null,null,null,null,null,null,null,null,null,null,null,null,null,null,null,null,null,null,null,null,null,null,null,null,null,null,null,null,null,null,null,null,null,null,null,null,null,null,null,null,null,null,null,null,null,null,null,null,null,null,null,null,null,null,null,null,null,null,null,null,null,null,null,null,null,null,null,null,null,null,null,null,null,null,null,null,null,null,null,null,null,null,null,null,null,null,null,null,null,null,null,null,null,null,null,null,null,null,null,null,null,null,null,null,null,null,null,null,null,null,null,null,null,null,null,null,null,null,null,null,null,null,null,null,null,null,null,null,null,null,null,null,null,null,null,null,null,null,null,null,null,null,null,null,null,null,null,null,null,null,null,6]
[null,null,37,"06533000","LK Limburg-Weilburg",null,null,null,null,null,null,"Brombachtal",null,null,null,null,null,7,null,null,null,null,null,null,null,null,null,null,null,null,null,null,null,null,null,null,null,null,null,null,null,null,null,null,null,null,null,null,null,null,null,null,null,null,null,null,null,null,null,null,null,null,null,null,null,null,null,null,null,null,null,null,null,null,null,null,null,null,null,null,null,null,null,null,null,null,null,null,null,null,null,null,null,null,null,null,null,null,null,null,null,null,null,null,null,null,null,null,null,null,null,null,null,null,null,null,null,null,null,null,null,null,null,null,null,null,null,null,null,null,null,null,null,null,null,null,null,null,null,null,null,null,null,null,null,null,null,null,null,null,null,null,null,null,null,null,null,null,null,null,null,null,null,null,null,null,null,null,null,null,null,null,null,null,null,null,null,null,null,7]
[null,null,38,"06533001","Beselich",null,null,null,null,null,null,"Bromskirchen",null,null,null,null,null,null,null,null,null,null,null,null,null,null,null,null,null,null,null,null,null,null,null,null,null,null,null,null,null,null,null,null,null,null,null,null,null,null,null,null,null,null,null,null,null,null,null,null,null,null,null,null,null,null,null,null,null,null,null,null,null,null,null,null,null,null,null,null,null,null,null,null,null,null,null,null,null,null,null,null,null,null,null,null,null,null,null,null,null,null,null,null,null,null,null,null,null,null,null,null,null,null,null,null,null,null,null,null,null,null,null,null,null,null,null,null,null,null,null,null,null,null,null,null,null,null,null,null,null,null,null,null,134,null,null,null,null,null,null,null,null,null,null,null,null,null,null,null,null,null,null,null,null,null,null,null,null,null,null,null,null,null,null,null,null,null,null,134]
[null,null,39,"06533002","Brechen",null,null,null,null,null,null,"Burghaun",null,null,null,null,null,null,null,null,null,null,null,null,null,null,null,null,null,null,null,null,null,null,null,null,null,null,null,null,null,null,null,null,null,null,null,null,null,null,null,null,null,null,null,null,null,null,null,null,null,null,null,null,null,null,null,null,null,null,null,null,null,null,null,null,null,null,null,null,null,null,null,null,null,null,null,null,null,79,null,null,null,null,null,null,null,null,null,null,null,null,null,null,null,null,null,null,null,null,null,null,null,null,null,null,null,null,null,null,null,null,null,null,null,null,null,null,null,null,null,null,null,null,null,null,null,null,null,null,null,null,null,null,null,null,null,null,null,null,null,null,null,null,null,null,null,null,null,null,null,null,null,null,null,null,null,null,null,null,null,null,null,null,null,null,null,null,null,79]
[null,null,40,"06533003","Bad Camberg",null,null,null,null,null,null,"Burgwald",null,null,null,null,null,null,null,null,null,null,null,null,null,null,null,null,null,null,null,null,null,null,null,null,null,null,null,null,null,null,null,null,null,null,null,null,null,null,null,null,null,null,null,null,null,null,null,null,null,null,null,null,null,null,null,null,null,null,null,null,null,null,null,null,null,null,null,null,null,null,null,null,null,null,null,null,null,null,null,null,null,null,null,null,null,null,null,null,null,null,null,null,null,null,null,null,null,null,null,null,null,null,null,null,null,null,null,null,null,null,null,null,null,null,null,null,null,null,null,null,null,null,null,null,null,null,null,null,null,null,null,null,null,135,null,null,null,null,null,null,null,null,null,null,null,null,null,null,null,null,null,null,null,null,null,null,null,null,null,null,null,null,null,null,null,null,null,135]
[null,null,41,"06533004","Dornburg",null,null,null,null,null,null,"Buseck",null,null,null,null,null,null,null,null,null,null,null,null,null,null,null,null,null,null,null,21,null,null,null,null,null,null,null,null,null,null,null,null,null,null,null,null,null,null,null,null,null,null,null,null,null,null,null,null,null,null,null,null,null,null,null,null,null,null,null,null,null,null,null,null,null,null,null,null,null,null,null,null,null,null,null,null,null,null,null,null,null,null,null,null,null,null,null,null,null,null,null,null,null,null,null,null,null,null,null,null,null,null,null,null,null,null,null,null,null,null,null,null,null,null,null,null,null,null,null,null,null,null,null,null,null,null,null,null,null,null,null,null,null,null,null,null,null,null,null,null,null,null,null,null,null,null,null,null,null,null,null,null,null,null,null,null,null,null,null,null,null,null,null,null,null,null,null,21]
[null,null,42,"06533005","Elbtal",null,null,null,null,null,null,"Diemelsee",null,null,null,null,null,null,null,null,null,null,null,null,null,null,null,null,null,null,null,null,null,null,null,null,null,null,null,null,null,null,null,null,null,null,null,null,null,null,null,null,null,null,null,null,null,null,null,null,null,null,null,null,null,null,null,null,null,null,null,null,null,null,null,null,null,null,null,null,null,null,null,null,null,null,null,null,null,null,null,null,null,null,null,null,null,null,null,null,null,null,null,null,null,null,null,null,null,null,null,null,null,null,null,null,null,null,null,null,null,null,null,null,null,null,null,null,null,null,null,null,null,null,null,null,null,null,null,null,null,null,null,null,null,null,136,null,null,null,null,null,null,null,null,null,null,null,null,null,null,null,null,null,null,null,null,null,null,null,null,null,null,null,null,null,null,null,null,136]
[null,null,43,"06533006","Elz",null,null,null,null,null,null,"Diemelstadt",null,null,null,null,null,null,null,null,null,null,null,null,null,null,null,null,null,null,null,null,null,null,null,null,null,null,null,null,null,null,null,null,null,null,null,null,null,null,null,null,null,null,null,null,null,null,null,null,null,null,null,null,null,null,null,null,null,null,null,null,null,null,null,null,null,null,null,null,null,null,null,null,null,null,null,null,null,null,null,null,null,null,null,null,null,null,null,null,null,null,null,null,null,null,null,null,null,null,null,null,null,null,null,null,null,null,null,null,null,null,null,null,null,null,null,null,null,null,null,null,null,null,null,null,null,null,null,null,null,null,null,null,null,null,null,137,null,null,null,null,null,null,null,null,null,null,null,null,null,null,null,null,null,null,null,null,null,null,null,null,null,null,null,null,null,null,null,137]
[null,null,44,"06533007","Hadamar",null,null,null,null,null,null,"Dipperz",null,null,null,null,null,null,null,null,null,null,null,null,null,null,null,null,null,null,null,null,null,null,null,null,null,null,null,null,null,null,null,null,null,null,null,null,null,null,null,null,null,null,null,null,null,null,null,null,null,null,null,null,null,null,null,null,null,null,null,null,null,null,null,null,null,null,null,null,null,null,null,null,null,null,null,null,null,null,80,null,null,null,null,null,null,null,null,null,null,null,null,null,null,null,null,null,null,null,null,null,null,null,null,null,null,null,null,null,null,null,null,null,null,null,null,null,null,null,null,null,null,null,null,null,null,null,null,null,null,null,null,null,null,null,null,null,null,null,null,null,null,null,null,null,null,null,null,null,null,null,null,null,null,null,null,null,null,null,null,null,null,null,null,null,null,null,null,80]
[null,null,45,"06533008","Hünfelden",null,null,null,null,null,null,"Dornburg",null,null,null,null,null,null,null,null,null,null,null,null,null,null,null,null,null,null,null,null,null,null,null,null,null,null,null,null,null,null,null,null,null,null,null,null,null,null,null,41,null,null,null,null,null,null,null,null,null,null,null,null,null,null,null,null,null,null,null,null,null,null,null,null,null,null,null,null,null,null,null,null,null,null,null,null,null,null,null,null,null,null,null,null,null,null,null,null,null,null,null,null,null,null,null,null,null,null,null,null,null,null,null,null,null,null,null,null,null,null,null,null,null,null,null,null,null,null,null,null,null,null,null,null,null,null,null,null,null,null,null,null,null,null,null,null,null,null,null,null,null,null,null,null,null,null,null,null,null,null,null,null,null,null,null,null,null,null,null,null,null,null,null,null,null,null,null,41]
[null,null,46,"06533009","Limburg an der Lahn",null,null,null,null,null,null,"Ebersburg",null,null,null,null,null,null,null,null,null,null,null,null,null,null,null,null,null,null,null,null,null,null,null,null,null,null,null,null,null,null,null,null,null,null,null,null,null,null,null,null,null,null,null,null,null,null,null,null,null,null,null,null,null,null,null,null,null,null,null,null,null,null,null,null,null,null,null,null,null,null,null,null,null,null,null,null,null,null,null,81,null,null,null,null,null,null,null,null,null,null,null,null,null,null,null,null,null,null,null,null,null,null,null,null,null,null,null,null,null,null,null,null,null,null,null,null,null,null,null,null,null,null,null,null,null,null,null,null,null,null,null,null,null,null,null,null,null,null,null,null,null,null,null,null,null,null,null,null,null,null,null,null,null,null,null,null,null,null,null,null,null,null,null,null,null,null,null,81]
[null,null,47,"06533010","Löhnberg",null,null,null,null,null,null,"Edermünde",null,null,null,null,null,null,null,null,null,null,null,null,null,null,null,null,null,null,null,null,null,null,null,null,null,null,null,null,null,null,null,null,null,null,null,null,null,null,null,null,null,null,null,null,null,null,null,null,null,null,null,null,null,null,null,null,null,null,null,null,null,null,null,null,null,null,null,null,null,null,null,null,null,null,null,null,null,null,null,null,null,null,null,null,null,null,null,null,null,null,null,null,null,null,null,null,null,null,null,null,null,103,null,null,null,null,null,null,null,null,null,null,null,null,null,null,null,null,null,null,null,null,null,null,null,null,null,null,null,null,null,null,null,null,null,null,null,null,null,null,null,null,null,null,null,null,null,null,null,null,null,null,null,null,null,null,null,null,null,null,null,null,null,null,null,null,null,103]
[null,null,48,"06533011","Mengerskirchen",null,null,null,null,null,null,"Edertal",null,null,null,null,null,null,null,null,null,null,null,null,null,null,null,null,null,null,null,null,null,null,null,null,null,null,null,null,null,null,null,null,null,null,null,null,null,null,null,null,null,null,null,null,null,null,null,null,null,null,null,null,null,null,null,null,null,null,null,null,null,null,null,null,null,null,null,null,null,null,null,null,null,null,null,null,null,null,null,null,null,null,null,null,null,null,null,null,null,null,null,null,null,null,null,null,null,null,null,null,null,null,null,null,null,null,null,null,null,null,null,null,null,null,null,null,null,null,null,null,null,null,null,null,null,null,null,null,null,null,null,null,null,null,null,null,138,null,null,null,null,null,null,null,null,null,null,null,null,null,null,null,null,null,null,null,null,null,null,null,null,null,null,null,null,null,null,138]
[null,null,49,"06533012","Merenberg",null,null,null,null,null,null,"Ehrenberg (Rhön)",null,null,null,null,null,null,null,null,null,null,null,null,null,null,null,null,null,null,null,null,null,null,null,null,null,null,null,null,null,null,null,null,null,null,null,null,null,null,null,null,null,null,null,null,null,null,null,null,null,null,null,null,null,null,null,null,null,null,null,null,null,null,null,null,null,null,null,null,null,null,null,null,null,null,null,null,null,null,null,null,82,null,null,null,null,null,null,null,null,null,null,null,null,null,null,null,null,null,null,null,null,null,null,null,null,null,null,null,null,null,null,null,null,null,null,null,null,null,null,null,null,null,null,null,null,null,null,null,null,null,null,null,null,null,null,null,null,null,null,null,null,null,null,null,null,null,null,null,null,null,null,null,null,null,null,null,null,null,null,null,null,null,null,null,null,null,null,82]
[null,null,50,"06533013","Runkel",null,null,null,null,null,null,"Eichenzell",null,null,null,null,null,null,null,null,null,null,null,null,null,null,null,null,null,null,null,null,null,null,null,null,null,null,null,null,null,null,null,null,null,null,null,null,null,null,null,null,null,null,null,null,null,null,null,null,null,null,null,null,null,null,null,null,null,null,null,null,null,null,null,null,null,null,null,null,null,null,null,null,null,null,null,null,null,null,null,null,null,83,null,null,null,null,null,null,null,null,null,null,null,null,null,null,null,null,null,null,null,null,null,null,null,null,null,null,null,null,null,null,null,null,null,null,null,null,null,null,null,null,null,null,null,null,null,null,null,null,null,null,null,null,null,null,null,null,null,null,null,null,null,null,null,null,null,null,null,null,null,null,null,null,null,null,null,null,null,null,null,null,null,null,null,null,null,83]
[null,null,51,"06533014","Selters (Taunus)",null,null,null,null,null,null,"Eiterfeld",null,null,null,null,null,null,null,null,null,null,null,null,null,null,null,null,null,null,null,null,null,null,null,null,null,null,null,null,null,null,null,null,null,null,null,null,null,null,null,null,null,null,null,null,null,null,null,null,null,null,null,null,null,null,null,null,null,null,null,null,null,null,null,null,null,null,null,null,null,null,null,null,null,null,null,null,null,null,null,null,null,null,84,null,null,null,null,null,null,null,null,null,null,null,null,null,null,null,null,null,null,null,null,null,null,null,null,null,null,null,null,null,null,null,null,null,null,null,null,null,null,null,null,null,null,null,null,null,null,null,null,null,null,null,null,null,null,null,null,null,null,null,null,null,null,null,null,null,null,null,null,null,null,null,null,null,null,null,null,null,null,null,null,null,null,null,null,84]
[null,null,52,"06533015","Villmar",null,null,null,null,null,null,"Elbtal",null,null,null,null,null,null,null,null,null,null,null,null,null,null,null,null,null,null,null,null,null,null,null,null,null,null,null,null,null,null,null,null,null,null,null,null,null,null,null,null,42,null,null,null,null,null,null,null,null,null,null,null,null,null,null,null,null,null,null,null,null,null,null,null,null,null,null,null,null,null,null,null,null,null,null,null,null,null,null,null,null,null,null,null,null,null,null,null,null,null,null,null,null,null,null,null,null,null,null,null,null,null,null,null,null,null,null,null,null,null,null,null,null,null,null,null,null,null,null,null,null,null,null,null,null,null,null,null,null,null,null,null,null,null,null,null,null,null,null,null,null,null,null,null,null,null,null,null,null,null,null,null,null,null,null,null,null,null,null,null,null,null,null,null,null,null,null,42]
[null,null,53,"06533016","Waldbrunn (Westerwald)",null,null,null,null,null,null,"Elz",null,null,null,null,null,null,null,null,null,null,null,null,null,null,null,null,null,null,null,null,null,null,null,null,null,null,null,null,null,null,null,null,null,null,null,null,null,null,null,null,null,43,null,null,null,null,null,null,null,null,null,null,null,null,null,null,null,null,null,null,null,null,null,null,null,null,null,null,null,null,null,null,null,null,null,null,null,null,null,null,null,null,null,null,null,null,null,null,null,null,null,null,null,null,null,null,null,null,null,null,null,null,null,null,null,null,null,null,null,null,null,null,null,null,null,null,null,null,null,null,null,null,null,null,null,null,null,null,null,null,null,null,null,null,null,null,null,null,null,null,null,null,null,null,null,null,null,null,null,null,null,null,null,null,null,null,null,null,null,null,null,null,null,null,null,null,null,43]
[null,null,54,"06533017","Weilburg",null,null,null,null,null,null,"Erbach",null,null,null,null,null,null,8,null,null,null,null,null,null,null,null,null,null,null,null,null,null,null,null,null,null,null,null,null,null,null,null,null,null,null,null,null,null,null,null,null,null,null,null,null,null,null,null,null,null,null,null,null,null,null,null,null,null,null,null,null,null,null,null,null,null,null,null,null,null,null,null,null,null,null,null,null,null,null,null,null,null,null,null,null,null,null,null,null,null,null,null,null,null,null,null,null,null,null,null,null,null,null,null,null,null,null,null,null,null,null,null,null,null,null,null,null,null,null,null,null,null,null,null,null,null,null,null,null,null,null,null,null,null,null,null,null,null,null,null,null,null,null,null,null,null,null,null,null,null,null,null,null,null,null,null,null,null,null,null,null,null,null,null,null,null,null,null,8]
[null,null,55,"06533018","Weilmünster",null,null,null,null,null,null,"Eschwege",null,null,null,null,null,null,null,null,null,null,null,null,null,null,null,null,null,null,null,null,null,null,null,null,null,null,null,null,null,null,null,null,null,null,null,null,null,null,null,null,null,null,null,null,null,null,null,null,null,null,null,null,null,null,null,null,null,null,null,null,null,null,null,null,null,null,null,null,null,null,null,null,null,null,null,null,null,null,null,null,null,null,null,null,null,null,null,null,null,null,null,null,null,null,null,null,null,null,null,null,null,null,null,null,null,null,null,null,null,null,null,null,null,null,null,null,null,null,null,null,null,null,null,null,null,null,null,null,null,null,null,null,null,null,null,null,null,null,null,null,null,null,null,null,null,null,null,null,null,null,null,null,null,155,null,null,null,null,null,null,null,null,null,null,null,null,null,155]
[null,null,56,"06533019","Weinbach",null,null,null,null,null,null,"Feldatal",null,null,null,null,null,null,null,null,null,null,null,null,null,null,null,null,null,null,null,null,null,null,null,null,null,null,null,null,null,null,null,null,null,null,null,null,null,null,null,null,null,null,null,null,null,null,null,null,null,null,null,null,null,null,null,null,null,null,60,null,null,null,null,null,null,null,null,null,null,null,null,null,null,null,null,null,null,null,null,null,null,null,null,null,null,null,null,null,null,null,null,null,null,null,null,null,null,null,null,null,null,null,null,null,null,null,null,null,null,null,null,null,null,null,null,null,null,null,null,null,null,null,null,null,null,null,null,null,null,null,null,null,null,null,null,null,null,null,null,null,null,null,null,null,null,null,null,null,null,null,null,null,null,null,null,null,null,null,null,null,null,null,null,null,null,null,null,60]
[null,null,57,"06535000","LK Vogelsberg",null,null,null,null,null,null,"Felsberg",null,null,null,null,null,null,null,null,null,null,null,null,null,null,null,null,null,null,null,null,null,null,null,null,null,null,null,null,null,null,null,null,null,null,null,null,null,null,null,null,null,null,null,null,null,null,null,null,null,null,null,null,null,null,null,null,null,null,null,null,null,null,null,null,null,null,null,null,null,null,null,null,null,null,null,null,null,null,null,null,null,null,null,null,null,null,null,null,null,null,null,null,null,null,null,null,null,null,null,null,null,null,104,null,null,null,null,null,null,null,null,null,null,null,null,null,null,null,null,null,null,null,null,null,null,null,null,null,null,null,null,null,null,null,null,null,null,null,null,null,null,null,null,null,null,null,null,null,null,null,null,null,null,null,null,null,null,null,null,null,null,null,null,null,null,null,null,104]
[null,null,58,"06535001","Alsfeld",null,null,null,null,null,null,"Fernwald",null,null,null,null,null,null,null,null,null,null,null,null,null,null,null,null,null,null,null,null,22,null,null,null,null,null,null,null,null,null,null,null,null,null,null,null,null,null,null,null,null,null,null,null,null,null,null,null,null,null,null,null,null,null,null,null,null,null,null,null,null,null,null,null,null,null,null,null,null,null,null,null,null,null,null,null,null,null,null,null,null,null,null,null,null,null,null,null,null,null,null,null,null,null,null,null,null,null,null,null,null,null,null,null,null,null,null,null,null,null,null,null,null,null,null,null,null,null,null,null,null,null,null,null,null,null,null,null,null,null,null,null,null,null,null,null,null,null,null,null,null,null,null,null,null,null,null,null,null,null,null,null,null,null,null,null,null,null,null,null,null,null,null,null,null,null,null,22]
[null,null,59,"06535002","Antrifttal",null,null,null,null,null,null,"Flieden",null,null,null,null,null,null,null,null,null,null,null,null,null,null,null,null,null,null,null,null,null,null,null,null,null,null,null,null,null,null,null,null,null,null,null,null,null,null,null,null,null,null,null,null,null,null,null,null,null,null,null,null,null,null,null,null,null,null,null,null,null,null,null,null,null,null,null,null,null,null,null,null,null,null,null,null,null,null,null,null,null,null,null,85,null,null,null,null,null,null,null,null,null,null,null,null,null,null,null,null,null,null,null,null,null,null,null,null,null,null,null,null,null,null,null,null,null,null,null,null,null,null,null,null,null,null,null,null,null,null,null,null,null,null,null,null,null,null,null,null,null,null,null,null,null,null,null,null,null,null,null,null,null,null,null,null,null,null,null,null,null,null,null,null,null,null,null,85]
[null,null,60,"06535003","Feldatal",null,null,null,null,null,null,"Frankenau",null,null,null,null,null,null,null,null,null,null,null,null,null,null,null,null,null,null,null,null,null,null,null,null,null,null,null,null,null,null,null,null,null,null,null,null,null,null,null,null,null,null,null,null,null,null,null,null,null,null,null,null,null,null,null,null,null,null,null,null,null,null,null,null,null,null,null,null,null,null,null,null,null,null,null,null,null,null,null,null,null,null,null,null,null,null,null,null,null,null,null,null,null,null,null,null,null,null,null,null,null,null,null,null,null,null,null,null,null,null,null,null,null,null,null,null,null,null,null,null,null,null,null,null,null,null,null,null,null,null,null,null,null,null,null,null,null,139,null,null,null,null,null,null,null,null,null,null,null,null,null,null,null,null,null,null,null,null,null,null,null,null,null,null,null,null,null,139]
[null,null,61,"06535004","Freiensteinau",null,null,null,null,null,null,"Frankenberg (Eder)",null,null,null,null,null,null,null,null,null,null,null,null,null,null,null,null,null,null,null,null,null,null,null,null,null,null,null,null,null,null,null,null,null,null,null,null,null,null,null,null,null,null,null,null,null,null,null,null,null,null,null,null,null,null,null,null,null,null,null,null,null,null,null,null,null,null,null,null,null,null,null,null,null,null,null,null,null,null,null,null,null,null,null,null,null,null,null,null,null,null,null,null,null,null,null,null,null,null,null,null,null,null,null,null,null,null,null,null,null,null,null,null,null,null,null,null,null,null,null,null,null,null,null,null,null,null,null,null,null,null,null,null,null,null,null,null,null,null,140,null,null,null,null,null,null,null,null,null,null,null,null,null,null,null,null,null,null,null,null,null,null,null,null,null,null,null,null,140]
[null,null,62,"06535005","Gemünden (Felda)",null,null,null,null,null,null,"Fränkisch-Crumbach",null,null,null,null,null,null,null,9,null,null,null,null,null,null,null,null,null,null,null,null,null,null,null,null,null,null,null,null,null,null,null,null,null,null,null,null,null,null,null,null,null,null,null,null,null,null,null,null,null,null,null,null,null,null,null,null,null,null,null,null,null,null,null,null,null,null,null,null,null,null,null,null,null,null,null,null,null,null,null,null,null,null,null,null,null,null,null,null,null,null,null,null,null,null,null,null,null,null,null,null,null,null,null,null,null,null,null,null,null,null,null,null,null,null,null,null,null,null,null,null,null,null,null,null,null,null,null,null,null,null,null,null,null,null,null,null,null,null,null,null,null,null,null,null,null,null,null,null,null,null,null,null,null,null,null,null,null,null,null,null,null,null,null,null,null,null,null,9]
[null,null,63,"06535006","Grebenau",null,null,null,null,null,null,"Freiensteinau",null,null,null,null,null,null,null,null,null,null,null,null,null,null,null,null,null,null,null,null,null,null,null,null,null,null,null,null,null,null,null,null,null,null,null,null,null,null,null,null,null,null,null,null,null,null,null,null,null,null,null,null,null,null,null,null,null,null,null,61,null,null,null,null,null,null,null,null,null,null,null,null,null,null,null,null,null,null,null,null,null,null,null,null,null,null,null,null,null,null,null,null,null,null,null,null,null,null,null,null,null,null,null,null,null,null,null,null,null,null,null,null,null,null,null,null,null,null,null,null,null,null,null,null,null,null,null,null,null,null,null,null,null,null,null,null,null,null,null,null,null,null,null,null,null,null,null,null,null,null,null,null,null,null,null,null,null,null,null,null,null,null,null,null,null,null,null,61]
[null,null,64,"06535007","Grebenhain",null,null,null,null,null,null,"Frielendorf",null,null,null,null,null,null,null,null,null,null,null,null,null,null,null,null,null,null,null,null,null,null,null,null,null,null,null,null,null,null,null,null,null,null,null,null,null,null,null,null,null,null,null,null,null,null,null,null,null,null,null,null,null,null,null,null,null,null,null,null,null,null,null,null,null,null,null,null,null,null,null,null,null,null,null,null,null,null,null,null,null,null,null,null,null,null,null,null,null,null,null,null,null,null,null,null,null,null,null,null,null,null,null,105,null,null,null,null,null,null,null,null,null,null,null,null,null,null,null,null,null,null,null,null,null,null,null,null,null,null,null,null,null,null,null,null,null,null,null,null,null,null,null,null,null,null,null,null,null,null,null,null,null,null,null,null,null,null,null,null,null,null,null,null,null,null,null,105]
[null,null,65,"06535008","Herbstein",null,null,null,null,null,null,"Fritzlar",null,null,null,null,null,null,null,null,null,null,null,null,null,null,null,null,null,null,null,null,null,null,null,null,null,null,null,null,null,null,null,null,null,null,null,null,null,null,null,null,null,null,null,null,null,null,null,null,null,null,null,null,null,null,null,null,null,null,null,null,null,null,null,null,null,null,null,null,null,null,null,null,null,null,null,null,null,null,null,null,null,null,null,null,null,null,null,null,null,null,null,null,null,null,null,null,null,null,null,null,null,null,null,null,106,null,null,null,null,null,null,null,null,null,null,null,null,null,null,null,null,null,null,null,null,null,null,null,null,null,null,null,null,null,null,null,null,null,null,null,null,null,null,null,null,null,null,null,null,null,null,null,null,null,null,null,null,null,null,null,null,null,null,null,null,null,null,106]
[null,null,66,"06535009","Homberg (Ohm)  ",null,null,null,null,null,null,"Fulda",null,null,null,null,null,null,null,null,null,null,null,null,null,null,null,null,null,null,null,null,null,null,null,null,null,null,null,null,null,null,null,null,null,null,null,null,null,null,null,null,null,null,null,null,null,null,null,null,null,null,null,null,null,null,null,null,null,null,null,null,null,null,null,null,null,null,null,null,null,null,null,null,null,null,null,null,null,null,null,null,null,null,null,null,86,null,null,null,null,null,null,null,null,null,null,null,null,null,null,null,null,null,null,null,null,null,null,null,null,null,null,null,null,null,null,null,null,null,null,null,null,null,null,null,null,null,null,null,null,null,null,null,null,null,null,null,null,null,null,null,null,null,null,null,null,null,null,null,null,null,null,null,null,null,null,null,null,null,null,null,null,null,null,null,null,null,null,86]
[null,null,67,"06535010","Kirtorf",null,null,null,null,null,null,"Gemünden (Felda)",null,null,null,null,null,null,null,null,null,null,null,null,null,null,null,null,null,null,null,null,null,null,null,null,null,null,null,null,null,null,null,null,null,null,null,null,null,null,null,null,null,null,null,null,null,null,null,null,null,null,null,null,null,null,null,null,null,null,null,null,62,null,null,null,null,null,null,null,null,null,null,null,null,null,null,null,null,null,null,null,null,null,null,null,null,null,null,null,null,null,null,null,null,null,null,null,null,null,null,null,null,null,null,null,null,null,null,null,null,null,null,null,null,null,null,null,null,null,null,null,null,null,null,null,null,null,null,null,null,null,null,null,null,null,null,null,null,null,null,null,null,null,null,null,null,null,null,null,null,null,null,null,null,null,null,null,null,null,null,null,null,null,null,null,null,null,null,62]
[null,null,68,"06535011","Lauterbach (Hessen)",null,null,null,null,null,null,"Gemünden (Wohra)",null,null,null,null,null,null,null,null,null,null,null,null,null,null,null,null,null,null,null,null,null,null,null,null,null,null,null,null,null,null,null,null,null,null,null,null,null,null,null,null,null,null,null,null,null,null,null,null,null,null,null,null,null,null,null,null,null,null,null,null,null,null,null,null,null,null,null,null,null,null,null,null,null,null,null,null,null,null,null,null,null,null,null,null,null,null,null,null,null,null,null,null,null,null,null,null,null,null,null,null,null,null,null,null,null,null,null,null,null,null,null,null,null,null,null,null,null,null,null,null,null,null,null,null,null,null,null,null,null,null,null,null,null,null,null,null,null,null,null,141,null,null,null,null,null,null,null,null,null,null,null,null,null,null,null,null,null,null,null,null,null,null,null,null,null,null,null,141]
[null,null,69,"06535012","Lautertal (Vogelsberg)",null,null,null,null,null,null,"Gersfeld (Rhön)",null,null,null,null,null,null,null,null,null,null,null,null,null,null,null,null,null,null,null,null,null,null,null,null,null,null,null,null,null,null,null,null,null,null,null,null,null,null,null,null,null,null,null,null,null,null,null,null,null,null,null,null,null,null,null,null,null,null,null,null,null,null,null,null,null,null,null,null,null,null,null,null,null,null,null,null,null,null,null,null,null,null,null,null,null,87,null,null,null,null,null,null,null,null,null,null,null,null,null,null,null,null,null,null,null,null,null,null,null,null,null,null,null,null,null,null,null,null,null,null,null,null,null,null,null,null,null,null,null,null,null,null,null,null,null,null,null,null,null,null,null,null,null,null,null,null,null,null,null,null,null,null,null,null,null,null,null,null,null,null,null,null,null,null,null,null,null,87]
[null,null,70,"06535013","Mücke",null,null,null,null,null,null,"Gießen",null,null,null,null,null,null,null,null,null,null,null,null,null,null,null,null,null,null,null,null,null,23,null,null,null,null,null,null,null,null,null,null,null,null,null,null,null,null,null,null,null,null,null,null,null,null,null,null,null,null,null,null,null,null,null,null,null,null,null,null,null,null,null,null,null,null,null,null,null,null,null,null,null,null,null,null,null,null,null,null,null,null,null,null,null,null,null,null,null,null,null,null,null,null,null,null,null,null,null,null,null,null,null,null,null,null,null,null,null,null,null,null,null,null,null,null,null,null,null,null,null,null,null,null,null,null,null,null,null,null,null,null,null,null,null,null,null,null,null,null,null,null,null,null,null,null,null,null,null,null,null,null,null,null,null,null,null,null,null,null,null,null,null,null,null,null,null,23]
[null,null,71,"06535014","Romrod",null,null,null,null,null,null,"Gilserberg",null,null,null,null,null,null,null,null,null,null,null,null,null,null,null,null,null,null,null,null,null,null,null,null,null,null,null,null,null,null,null,null,null,null,null,null,null,null,null,null,null,null,null,null,null,null,null,null,null,null,null,null,null,null,null,null,null,null,null,null,null,null,null,null,null,null,null,null,null,null,null,null,null,null,null,null,null,null,null,null,null,null,null,null,null,null,null,null,null,null,null,null,null,null,null,null,null,null,null,null,null,null,null,null,null,107,null,null,null,null,null,null,null,null,null,null,null,null,null,null,null,null,null,null,null,null,null,null,null,null,null,null,null,null,null,null,null,null,null,null,null,null,null,null,null,null,null,null,null,null,null,null,null,null,null,null,null,null,null,null,null,null,null,null,null,null,null,107]
[null,null,72,"06535015","Schlitz",null,null,null,null,null,null,"Grebenau",null,null,null,null,null,null,null,null,null,null,null,null,null,null,null,null,null,null,null,null,null,null,null,null,null,null,null,null,null,null,null,null,null,null,null,null,null,null,null,null,null,null,null,null,null,null,null,null,null,null,null,null,null,null,null,null,null,null,null,null,null,63,null,null,null,null,null,null,null,null,null,null,null,null,null,null,null,null,null,null,null,null,null,null,null,null,null,null,null,null,null,null,null,null,null,null,null,null,null,null,null,null,null,null,null,null,null,null,null,null,null,null,null,null,null,null,null,null,null,null,null,null,null,null,null,null,null,null,null,null,null,null,null,null,null,null,null,null,null,null,null,null,null,null,null,null,null,null,null,null,null,null,null,null,null,null,null,null,null,null,null,null,null,null,null,null,null,63]
[null,null,73,"06535016","Schotten",null,null,null,null,null,null,"Grebenhain",null,null,null,null,null,null,null,null,null,null,null,null,null,null,null,null,null,null,null,null,null,null,null,null,null,null,null,null,null,null,null,null,null,null,null,null,null,null,null,null,null,null,null,null,null,null,null,null,null,null,null,null,null,null,null,null,null,null,null,null,null,null,64,null,null,null,null,null,null,null,null,null,null,null,null,null,null,null,null,null,null,null,null,null,null,null,null,null,null,null,null,null,null,null,null,null,null,null,null,null,null,null,null,null,null,null,null,null,null,null,null,null,null,null,null,null,null,null,null,null,null,null,null,null,null,null,null,null,null,null,null,null,null,null,null,null,null,null,null,null,null,null,null,null,null,null,null,null,null,null,null,null,null,null,null,null,null,null,null,null,null,null,null,null,null,null,null,64]
[null,null,74,"06535017","Schwalmtal",null,null,null,null,null,null,"Großalmerode",null,null,null,null,null,null,null,null,null,null,null,null,null,null,null,null,null,null,null,null,null,null,null,null,null,null,null,null,null,null,null,null,null,null,null,null,null,null,null,null,null,null,null,null,null,null,null,null,null,null,null,null,null,null,null,null,null,null,null,null,null,null,null,null,null,null,null,null,null,null,null,null,null,null,null,null,null,null,null,null,null,null,null,null,null,null,null,null,null,null,null,null,null,null,null,null,null,null,null,null,null,null,null,null,null,null,null,null,null,null,null,null,null,null,null,null,null,null,null,null,null,null,null,null,null,null,null,null,null,null,null,null,null,null,null,null,null,null,null,null,null,null,null,null,null,null,null,null,null,null,null,null,null,null,156,null,null,null,null,null,null,null,null,null,null,null,null,156]
[null,null,75,"06535018","Ulrichstein",null,null,null,null,null,null,"Großenlüder",null,null,null,null,null,null,null,null,null,null,null,null,null,null,null,null,null,null,null,null,null,null,null,null,null,null,null,null,null,null,null,null,null,null,null,null,null,null,null,null,null,null,null,null,null,null,null,null,null,null,null,null,null,null,null,null,null,null,null,null,null,null,null,null,null,null,null,null,null,null,null,null,null,null,null,null,null,null,null,null,null,null,null,null,null,null,88,null,null,null,null,null,null,null,null,null,null,null,null,null,null,null,null,null,null,null,null,null,null,null,null,null,null,null,null,null,null,null,null,null,null,null,null,null,null,null,null,null,null,null,null,null,null,null,null,null,null,null,null,null,null,null,null,null,null,null,null,null,null,null,null,null,null,null,null,null,null,null,null,null,null,null,null,null,null,null,null,88]
[null,null,76,"06535019","Wartenberg",null,null,null,null,null,null,"Grünberg",null,null,null,null,null,null,null,null,null,null,null,null,null,null,null,null,null,null,null,null,null,null,24,null,null,null,null,null,null,null,null,null,null,null,null,null,null,null,null,null,null,null,null,null,null,null,null,null,null,null,null,null,null,null,null,null,null,null,null,null,null,null,null,null,null,null,null,null,null,null,null,null,null,null,null,null,null,null,null,null,null,null,null,null,null,null,null,null,null,null,null,null,null,null,null,null,null,null,null,null,null,null,null,null,null,null,null,null,null,null,null,null,null,null,null,null,null,null,null,null,null,null,null,null,null,null,null,null,null,null,null,null,null,null,null,null,null,null,null,null,null,null,null,null,null,null,null,null,null,null,null,null,null,null,null,null,null,null,null,null,null,null,null,null,null,null,null,24]
[null,null,77,"06631000","LK Fulda",null,null,null,null,null,null,"Gudensberg",null,null,null,null,null,null,null,null,null,null,null,null,null,null,null,null,null,null,null,null,null,null,null,null,null,null,null,null,null,null,null,null,null,null,null,null,null,null,null,null,null,null,null,null,null,null,null,null,null,null,null,null,null,null,null,null,null,null,null,null,null,null,null,null,null,null,null,null,null,null,null,null,null,null,null,null,null,null,null,null,null,null,null,null,null,null,null,null,null,null,null,null,null,null,null,null,null,null,null,null,null,null,null,null,null,null,108,null,null,null,null,null,null,null,null,null,null,null,null,null,null,null,null,null,null,null,null,null,null,null,null,null,null,null,null,null,null,null,null,null,null,null,null,null,null,null,null,null,null,null,null,null,null,null,null,null,null,null,null,null,null,null,null,null,null,null,null,108]
[null,null,78,"06631001","Bad Salzschlirf",null,null,null,null,null,null,"Guxhagen",null,null,null,null,null,null,null,null,null,null,null,null,null,null,null,null,null,null,null,null,null,null,null,null,null,null,null,null,null,null,null,null,null,null,null,null,null,null,null,null,null,null,null,null,null,null,null,null,null,null,null,null,null,null,null,null,null,null,null,null,null,null,null,null,null,null,null,null,null,null,null,null,null,null,null,null,null,null,null,null,null,null,null,null,null,null,null,null,null,null,null,null,null,null,null,null,null,null,null,null,null,null,null,null,null,null,null,109,null,null,null,null,null,null,null,null,null,null,null,null,null,null,null,null,null,null,null,null,null,null,null,null,null,null,null,null,null,null,null,null,null,null,null,null,null,null,null,null,null,null,null,null,null,null,null,null,null,null,null,null,null,null,null,null,null,null,null,109]
[null,null,79,"06631002","Burghaun",null,null,null,null,null,null,"Hadamar",null,null,null,null,null,null,null,null,null,null,null,null,null,null,null,null,null,null,null,null,null,null,null,null,null,null,null,null,null,null,null,null,null,null,null,null,null,null,null,null,null,null,44,null,null,null,null,null,null,null,null,null,null,null,null,null,null,null,null,null,null,null,null,null,null,null,null,null,null,null,null,null,null,null,null,null,null,null,null,null,null,null,null,null,null,null,null,null,null,null,null,null,null,null,null,null,null,null,null,null,null,null,null,null,null,null,null,null,null,null,null,null,null,null,null,null,null,null,null,null,null,null,null,null,null,null,null,null,null,null,null,null,null,null,null,null,null,null,null,null,null,null,null,null,null,null,null,null,null,null,null,null,null,null,null,null,null,null,null,null,null,null,null,null,null,null,null,44]
[null,null,80,"06631003","Dipperz",null,null,null,null,null,null,"Haina (Kloster)",null,null,null,null,null,null,null,null,null,null,null,null,null,null,null,null,null,null,null,null,null,null,null,null,null,null,null,null,null,null,null,null,null,null,null,null,null,null,null,null,null,null,null,null,null,null,null,null,null,null,null,null,null,null,null,null,null,null,null,null,null,null,null,null,null,null,null,null,null,null,null,null,null,null,null,null,null,null,null,null,null,null,null,null,null,null,null,null,null,null,null,null,null,null,null,null,null,null,null,null,null,null,null,null,null,null,null,null,null,null,null,null,null,null,null,null,null,null,null,null,null,null,null,null,null,null,null,null,null,null,null,null,null,null,null,null,null,null,null,null,142,null,null,null,null,null,null,null,null,null,null,null,null,null,null,null,null,null,null,null,null,null,null,null,null,null,null,142]
[null,null,81,"06631004","Ebersburg",null,null,null,null,null,null,"Hatzfeld (Eder)",null,null,null,null,null,null,null,null,null,null,null,null,null,null,null,null,null,null,null,null,null,null,null,null,null,null,null,null,null,null,null,null,null,null,null,null,null,null,null,null,null,null,null,null,null,null,null,null,null,null,null,null,null,null,null,null,null,null,null,null,null,null,null,null,null,null,null,null,null,null,null,null,null,null,null,null,null,null,null,null,null,null,null,null,null,null,null,null,null,null,null,null,null,null,null,null,null,null,null,null,null,null,null,null,null,null,null,null,null,null,null,null,null,null,null,null,null,null,null,null,null,null,null,null,null,null,null,null,null,null,null,null,null,null,null,null,null,null,null,null,null,143,null,null,null,null,null,null,null,null,null,null,null,null,null,null,null,null,null,null,null,null,null,null,null,null,null,143]
[null,null,82,"06631005","Ehrenberg (Rhön)",null,null,null,null,null,null,"Herbstein",null,null,null,null,null,null,null,null,null,null,null,null,null,null,null,null,null,null,null,null,null,null,null,null,null,null,null,null,null,null,null,null,null,null,null,null,null,null,null,null,null,null,null,null,null,null,null,null,null,null,null,null,null,null,null,null,null,null,null,null,null,null,null,65,null,null,null,null,null,null,null,null,null,null,null,null,null,null,null,null,null,null,null,null,null,null,null,null,null,null,null,null,null,null,null,null,null,null,null,null,null,null,null,null,null,null,null,null,null,null,null,null,null,null,null,null,null,null,null,null,null,null,null,null,null,null,null,null,null,null,null,null,null,null,null,null,null,null,null,null,null,null,null,null,null,null,null,null,null,null,null,null,null,null,null,null,null,null,null,null,null,null,null,null,null,null,null,65]
[null,null,83,"06631006","Eichenzell",null,null,null,null,null,null,"Herleshausen",null,null,null,null,null,null,null,null,null,null,null,null,null,null,null,null,null,null,null,null,null,null,null,null,null,null,null,null,null,null,null,null,null,null,null,null,null,null,null,null,null,null,null,null,null,null,null,null,null,null,null,null,null,null,null,null,null,null,null,null,null,null,null,null,null,null,null,null,null,null,null,null,null,null,null,null,null,null,null,null,null,null,null,null,null,null,null,null,null,null,null,null,null,null,null,null,null,null,null,null,null,null,null,null,null,null,null,null,null,null,null,null,null,null,null,null,null,null,null,null,null,null,null,null,null,null,null,null,null,null,null,null,null,null,null,null,null,null,null,null,null,null,null,null,null,null,null,null,null,null,null,null,null,null,null,157,null,null,null,null,null,null,null,null,null,null,null,157]
[null,null,84,"06631007","Eiterfeld",null,null,null,null,null,null,"Hesseneck",null,null,null,null,null,null,null,null,10,null,null,null,null,null,null,null,null,null,null,null,null,null,null,null,null,null,null,null,null,null,null,null,null,null,null,null,null,null,null,null,null,null,null,null,null,null,null,null,null,null,null,null,null,null,null,null,null,null,null,null,null,null,null,null,null,null,null,null,null,null,null,null,null,null,null,null,null,null,null,null,null,null,null,null,null,null,null,null,null,null,null,null,null,null,null,null,null,null,null,null,null,null,null,null,null,null,null,null,null,null,null,null,null,null,null,null,null,null,null,null,null,null,null,null,null,null,null,null,null,null,null,null,null,null,null,null,null,null,null,null,null,null,null,null,null,null,null,null,null,null,null,null,null,null,null,null,null,null,null,null,null,null,null,null,null,null,null,10]
[null,null,85,"06631008","Flieden",null,null,null,null,null,null,"Hessisch Lichtenau",null,null,null,null,null,null,null,null,null,null,null,null,null,null,null,null,null,null,null,null,null,null,null,null,null,null,null,null,null,null,null,null,null,null,null,null,null,null,null,null,null,null,null,null,null,null,null,null,null,null,null,null,null,null,null,null,null,null,null,null,null,null,null,null,null,null,null,null,null,null,null,null,null,null,null,null,null,null,null,null,null,null,null,null,null,null,null,null,null,null,null,null,null,null,null,null,null,null,null,null,null,null,null,null,null,null,null,null,null,null,null,null,null,null,null,null,null,null,null,null,null,null,null,null,null,null,null,null,null,null,null,null,null,null,null,null,null,null,null,null,null,null,null,null,null,null,null,null,null,null,null,null,null,null,null,null,158,null,null,null,null,null,null,null,null,null,null,158]
[null,null,86,"06631009","Fulda",null,null,null,null,null,null,"Heuchelheim",null,null,null,null,null,null,null,null,null,null,null,null,null,null,null,null,null,null,null,null,null,null,null,25,null,null,null,null,null,null,null,null,null,null,null,null,null,null,null,null,null,null,null,null,null,null,null,null,null,null,null,null,null,null,null,null,null,null,null,null,null,null,null,null,null,null,null,null,null,null,null,null,null,null,null,null,null,null,null,null,null,null,null,null,null,null,null,null,null,null,null,null,null,null,null,null,null,null,null,null,null,null,null,null,null,null,null,null,null,null,null,null,null,null,null,null,null,null,null,null,null,null,null,null,null,null,null,null,null,null,null,null,null,null,null,null,null,null,null,null,null,null,null,null,null,null,null,null,null,null,null,null,null,null,null,null,null,null,null,null,null,null,null,null,null,null,null,25]
[null,null,87,"06631010","Gersfeld (Rhön)",null,null,null,null,null,null,"Hilders",null,null,null,null,null,null,null,null,null,null,null,null,null,null,null,null,null,null,null,null,null,null,null,null,null,null,null,null,null,null,null,null,null,null,null,null,null,null,null,null,null,null,null,null,null,null,null,null,null,null,null,null,null,null,null,null,null,null,null,null,null,null,null,null,null,null,null,null,null,null,null,null,null,null,null,null,null,null,null,null,null,null,null,null,null,null,null,89,null,null,null,null,null,null,null,null,null,null,null,null,null,null,null,null,null,null,null,null,null,null,null,null,null,null,null,null,null,null,null,null,null,null,null,null,null,null,null,null,null,null,null,null,null,null,null,null,null,null,null,null,null,null,null,null,null,null,null,null,null,null,null,null,null,null,null,null,null,null,null,null,null,null,null,null,null,null,null,89]
[null,null,88,"06631011","Großenlüder",null,null,null,null,null,null,"Höchst i.Odw.",null,null,null,null,null,null,null,null,null,11,null,null,null,null,null,null,null,null,null,null,null,null,null,null,null,null,null,null,null,null,null,null,null,null,null,null,null,null,null,null,null,null,null,null,null,null,null,null,null,null,null,null,null,null,null,null,null,null,null,null,null,null,null,null,null,null,null,null,null,null,null,null,null,null,null,null,null,null,null,null,null,null,null,null,null,null,null,null,null,null,null,null,null,null,null,null,null,null,null,null,null,null,null,null,null,null,null,null,null,null,null,null,null,null,null,null,null,null,null,null,null,null,null,null,null,null,null,null,null,null,null,null,null,null,null,null,null,null,null,null,null,null,null,null,null,null,null,null,null,null,null,null,null,null,null,null,null,null,null,null,null,null,null,null,null,null,null,11]
[null,null,89,"06631012","Hilders",null,null,null,null,null,null,"Hofbieber",null,null,null,null,null,null,null,null,null,null,null,null,null,null,null,null,null,null,null,null,null,null,null,null,null,null,null,null,null,null,null,null,null,null,null,null,null,null,null,null,null,null,null,null,null,null,null,null,null,null,null,null,null,null,null,null,null,null,null,null,null,null,null,null,null,null,null,null,null,null,null,null,null,null,null,null,null,null,null,null,null,null,null,null,null,null,null,null,90,null,null,null,null,null,null,null,null,null,null,null,null,null,null,null,null,null,null,null,null,null,null,null,null,null,null,null,null,null,null,null,null,null,null,null,null,null,null,null,null,null,null,null,null,null,null,null,null,null,null,null,null,null,null,null,null,null,null,null,null,null,null,null,null,null,null,null,null,null,null,null,null,null,null,null,null,null,null,90]
[null,null,90,"06631013","Hofbieber",null,null,null,null,null,null,"Homberg (Efze)",null,null,null,null,null,null,null,null,null,null,null,null,null,null,null,null,null,null,null,null,null,null,null,null,null,null,null,null,null,null,null,null,null,null,null,null,null,null,null,null,null,null,null,null,null,null,null,null,null,null,null,null,null,null,null,null,null,null,null,null,null,null,null,null,null,null,null,null,null,null,null,null,null,null,null,null,null,null,null,null,null,null,null,null,null,null,null,null,null,null,null,null,null,null,null,null,null,null,null,null,null,null,null,null,null,null,null,null,110,null,null,null,null,null,null,null,null,null,null,null,null,null,null,null,null,null,null,null,null,null,null,null,null,null,null,null,null,null,null,null,null,null,null,null,null,null,null,null,null,null,null,null,null,null,null,null,null,null,null,null,null,null,null,null,null,null,null,110]
[null,null,91,"06631014","Hosenfeld",null,null,null,null,null,null,"Homberg (Ohm)  ",null,null,null,null,null,null,null,null,null,null,null,null,null,null,null,null,null,null,null,null,null,null,null,null,null,null,null,null,null,null,null,null,null,null,null,null,null,null,null,null,null,null,null,null,null,null,null,null,null,null,null,null,null,null,null,null,null,null,null,null,null,null,null,null,66,null,null,null,null,null,null,null,null,null,null,null,null,null,null,null,null,null,null,null,null,null,null,null,null,null,null,null,null,null,null,null,null,null,null,null,null,null,null,null,null,null,null,null,null,null,null,null,null,null,null,null,null,null,null,null,null,null,null,null,null,null,null,null,null,null,null,null,null,null,null,null,null,null,null,null,null,null,null,null,null,null,null,null,null,null,null,null,null,null,null,null,null,null,null,null,null,null,null,null,null,null,null,66]
[null,null,92,"06631015","Hünfeld",null,null,null,null,null,null,"Hosenfeld",null,null,null,null,null,null,null,null,null,null,null,null,null,null,null,null,null,null,null,null,null,null,null,null,null,null,null,null,null,null,null,null,null,null,null,null,null,null,null,null,null,null,null,null,null,null,null,null,null,null,null,null,null,null,null,null,null,null,null,null,null,null,null,null,null,null,null,null,null,null,null,null,null,null,null,null,null,null,null,null,null,null,null,null,null,null,null,null,null,91,null,null,null,null,null,null,null,null,null,null,null,null,null,null,null,null,null,null,null,null,null,null,null,null,null,null,null,null,null,null,null,null,null,null,null,null,null,null,null,null,null,null,null,null,null,null,null,null,null,null,null,null,null,null,null,null,null,null,null,null,null,null,null,null,null,null,null,null,null,null,null,null,null,null,null,null,null,91]
[null,null,93,"06631016","Kalbach",null,null,null,null,null,null,"Hünfeld",null,null,null,null,null,null,null,null,null,null,null,null,null,null,null,null,null,null,null,null,null,null,null,null,null,null,null,null,null,null,null,null,null,null,null,null,null,null,null,null,null,null,null,null,null,null,null,null,null,null,null,null,null,null,null,null,null,null,null,null,null,null,null,null,null,null,null,null,null,null,null,null,null,null,null,null,null,null,null,null,null,null,null,null,null,null,null,null,null,null,92,null,null,null,null,null,null,null,null,null,null,null,null,null,null,null,null,null,null,null,null,null,null,null,null,null,null,null,null,null,null,null,null,null,null,null,null,null,null,null,null,null,null,null,null,null,null,null,null,null,null,null,null,null,null,null,null,null,null,null,null,null,null,null,null,null,null,null,null,null,null,null,null,null,null,null,null,92]
[null,null,94,"06631017","Künzell",null,null,null,null,null,null,"Hünfelden",null,null,null,null,null,null,null,null,null,null,null,null,null,null,null,null,null,null,null,null,null,null,null,null,null,null,null,null,null,null,null,null,null,null,null,null,null,null,null,null,null,null,null,45,null,null,null,null,null,null,null,null,null,null,null,null,null,null,null,null,null,null,null,null,null,null,null,null,null,null,null,null,null,null,null,null,null,null,null,null,null,null,null,null,null,null,null,null,null,null,null,null,null,null,null,null,null,null,null,null,null,null,null,null,null,null,null,null,null,null,null,null,null,null,null,null,null,null,null,null,null,null,null,null,null,null,null,null,null,null,null,null,null,null,null,null,null,null,null,null,null,null,null,null,null,null,null,null,null,null,null,null,null,null,null,null,null,null,null,null,null,null,null,null,null,null,null,45]
[null,null,95,"06631018","Neuhof",null,null,null,null,null,null,"Hungen",null,null,null,null,null,null,null,null,null,null,null,null,null,null,null,null,null,null,null,null,null,null,null,null,26,null,null,null,null,null,null,null,null,null,null,null,null,null,null,null,null,null,null,null,null,null,null,null,null,null,null,null,null,null,null,null,null,null,null,null,null,null,null,null,null,null,null,null,null,null,null,null,null,null,null,null,null,null,null,null,null,null,null,null,null,null,null,null,null,null,null,null,null,null,null,null,null,null,null,null,null,null,null,null,null,null,null,null,null,null,null,null,null,null,null,null,null,null,null,null,null,null,null,null,null,null,null,null,null,null,null,null,null,null,null,null,null,null,null,null,null,null,null,null,null,null,null,null,null,null,null,null,null,null,null,null,null,null,null,null,null,null,null,null,null,null,null,26]
[null,null,96,"06631019","Nüsttal",null,null,null,null,null,null,"Jesberg",null,null,null,null,null,null,null,null,null,null,null,null,null,null,null,null,null,null,null,null,null,null,null,null,null,null,null,null,null,null,null,null,null,null,null,null,null,null,null,null,null,null,null,null,null,null,null,null,null,null,null,null,null,null,null,null,null,null,null,null,null,null,null,null,null,null,null,null,null,null,null,null,null,null,null,null,null,null,null,null,null,null,null,null,null,null,null,null,null,null,null,null,null,null,null,null,null,null,null,null,null,null,null,null,null,null,null,null,null,111,null,null,null,null,null,null,null,null,null,null,null,null,null,null,null,null,null,null,null,null,null,null,null,null,null,null,null,null,null,null,null,null,null,null,null,null,null,null,null,null,null,null,null,null,null,null,null,null,null,null,null,null,null,null,null,null,null,111]
[null,null,97,"06631020","Petersberg",null,null,null,null,null,null,"Kalbach",null,null,null,null,null,null,null,null,null,null,null,null,null,null,null,null,null,null,null,null,null,null,null,null,null,null,null,null,null,null,null,null,null,null,null,null,null,null,null,null,null,null,null,null,null,null,null,null,null,null,null,null,null,null,null,null,null,null,null,null,null,null,null,null,null,null,null,null,null,null,null,null,null,null,null,null,null,null,null,null,null,null,null,null,null,null,null,null,null,null,null,93,null,null,null,null,null,null,null,null,null,null,null,null,null,null,null,null,null,null,null,null,null,null,null,null,null,null,null,null,null,null,null,null,null,null,null,null,null,null,null,null,null,null,null,null,null,null,null,null,null,null,null,null,null,null,null,null,null,null,null,null,null,null,null,null,null,null,null,null,null,null,null,null,null,null,null,93]
[null,null,98,"06631021","Poppenhausen (Wasserkuppe) ",null,null,null,null,null,null,"Kirtorf",null,null,null,null,null,null,null,null,null,null,null,null,null,null,null,null,null,null,null,null,null,null,null,null,null,null,null,null,null,null,null,null,null,null,null,null,null,null,null,null,null,null,null,null,null,null,null,null,null,null,null,null,null,null,null,null,null,null,null,null,null,null,null,null,null,67,null,null,null,null,null,null,null,null,null,null,null,null,null,null,null,null,null,null,null,null,null,null,null,null,null,null,null,null,null,null,null,null,null,null,null,null,null,null,null,null,null,null,null,null,null,null,null,null,null,null,null,null,null,null,null,null,null,null,null,null,null,null,null,null,null,null,null,null,null,null,null,null,null,null,null,null,null,null,null,null,null,null,null,null,null,null,null,null,null,null,null,null,null,null,null,null,null,null,null,null,null,67]
[null,null,99,"06631022","Rasdorf",null,null,null,null,null,null,"Knüllwald",null,null,null,null,null,null,null,null,null,null,null,null,null,null,null,null,null,null,null,null,null,null,null,null,null,null,null,null,null,null,null,null,null,null,null,null,null,null,null,null,null,null,null,null,null,null,null,null,null,null,null,null,null,null,null,null,null,null,null,null,null,null,null,null,null,null,null,null,null,null,null,null,null,null,null,null,null,null,null,null,null,null,null,null,null,null,null,null,null,null,null,null,null,null,null,null,null,null,null,null,null,null,null,null,null,null,null,null,null,null,112,null,null,null,null,null,null,null,null,null,null,null,null,null,null,null,null,null,null,null,null,null,null,null,null,null,null,null,null,null,null,null,null,null,null,null,null,null,null,null,null,null,null,null,null,null,null,null,null,null,null,null,null,null,null,null,null,112]
[null,null,100,"06631023","Tann (Rhön)",null,null,null,null,null,null,"Korbach",null,null,null,null,null,null,null,null,null,null,null,null,null,null,null,null,null,null,null,null,null,null,null,null,null,null,null,null,null,null,null,null,null,null,null,null,null,null,null,null,null,null,null,null,null,null,null,null,null,null,null,null,null,null,null,null,null,null,null,null,null,null,null,null,null,null,null,null,null,null,null,null,null,null,null,null,null,null,null,null,null,null,null,null,null,null,null,null,null,null,null,null,null,null,null,null,null,null,null,null,null,null,null,null,null,null,null,null,null,null,null,null,null,null,null,null,null,null,null,null,null,null,null,null,null,null,null,null,null,null,null,null,null,null,null,null,null,null,null,null,null,null,144,null,null,null,null,null,null,null,null,null,null,null,null,null,null,null,null,null,null,null,null,null,null,null,null,144]
[null,null,101,"06634000","LK Schwalm-Eder",null,null,null,null,null,null,"Körle",null,null,null,null,null,null,null,null,null,null,null,null,null,null,null,null,null,null,null,null,null,null,null,null,null,null,null,null,null,null,null,null,null,null,null,null,null,null,null,null,null,null,null,null,null,null,null,null,null,null,null,null,null,null,null,null,null,null,null,null,null,null,null,null,null,null,null,null,null,null,null,null,null,null,null,null,null,null,null,null,null,null,null,null,null,null,null,null,null,null,null,null,null,null,null,null,null,null,null,null,null,null,null,null,null,null,null,null,null,null,null,113,null,null,null,null,null,null,null,null,null,null,null,null,null,null,null,null,null,null,null,null,null,null,null,null,null,null,null,null,null,null,null,null,null,null,null,null,null,null,null,null,null,null,null,null,null,null,null,null,null,null,null,null,null,null,null,113]
[null,null,102,"06634001","Borken (Hessen)",null,null,null,null,null,null,"Künzell",null,null,null,null,null,null,null,null,null,null,null,null,null,null,null,null,null,null,null,null,null,null,null,null,null,null,null,null,null,null,null,null,null,null,null,null,null,null,null,null,null,null,null,null,null,null,null,null,null,null,null,null,null,null,null,null,null,null,null,null,null,null,null,null,null,null,null,null,null,null,null,null,null,null,null,null,null,null,null,null,null,null,null,null,null,null,null,null,null,null,null,null,94,null,null,null,null,null,null,null,null,null,null,null,null,null,null,null,null,null,null,null,null,null,null,null,null,null,null,null,null,null,null,null,null,null,null,null,null,null,null,null,null,null,null,null,null,null,null,null,null,null,null,null,null,null,null,null,null,null,null,null,null,null,null,null,null,null,null,null,null,null,null,null,null,null,null,94]
[null,null,103,"06634002","Edermünde",null,null,null,null,null,null,"Langgöns",null,null,null,null,null,null,null,null,null,null,null,null,null,null,null,null,null,null,null,null,null,null,null,null,null,27,null,null,null,null,null,null,null,null,null,null,null,null,null,null,null,null,null,null,null,null,null,null,null,null,null,null,null,null,null,null,null,null,null,null,null,null,null,null,null,null,null,null,null,null,null,null,null,null,null,null,null,null,null,null,null,null,null,null,null,null,null,null,null,null,null,null,null,null,null,null,null,null,null,null,null,null,null,null,null,null,null,null,null,null,null,null,null,null,null,null,null,null,null,null,null,null,null,null,null,null,null,null,null,null,null,null,null,null,null,null,null,null,null,null,null,null,null,null,null,null,null,null,null,null,null,null,null,null,null,null,null,null,null,null,null,null,null,null,null,null,null,27]
[null,null,104,"06634003","Felsberg",null,null,null,null,null,null,"Laubach",null,null,null,null,null,null,null,null,null,null,null,null,null,null,null,null,null,null,null,null,null,null,null,null,null,null,28,null,null,null,null,null,null,null,null,null,null,null,null,null,null,null,null,null,null,null,null,null,null,null,null,null,null,null,null,null,null,null,null,null,null,null,null,null,null,null,null,null,null,null,null,null,null,null,null,null,null,null,null,null,null,null,null,null,null,null,null,null,null,null,null,null,null,null,null,null,null,null,null,null,null,null,null,null,null,null,null,null,null,null,null,null,null,null,null,null,null,null,null,null,null,null,null,null,null,null,null,null,null,null,null,null,null,null,null,null,null,null,null,null,null,null,null,null,null,null,null,null,null,null,null,null,null,null,null,null,null,null,null,null,null,null,null,null,null,null,null,28]
[null,null,105,"06634004","Frielendorf",null,null,null,null,null,null,"Lauterbach (Hessen)",null,null,null,null,null,null,null,null,null,null,null,null,null,null,null,null,null,null,null,null,null,null,null,null,null,null,null,null,null,null,null,null,null,null,null,null,null,null,null,null,null,null,null,null,null,null,null,null,null,null,null,null,null,null,null,null,null,null,null,null,null,null,null,null,null,null,68,null,null,null,null,null,null,null,null,null,null,null,null,null,null,null,null,null,null,null,null,null,null,null,null,null,null,null,null,null,null,null,null,null,null,null,null,null,null,null,null,null,null,null,null,null,null,null,null,null,null,null,null,null,null,null,null,null,null,null,null,null,null,null,null,null,null,null,null,null,null,null,null,null,null,null,null,null,null,null,null,null,null,null,null,null,null,null,null,null,null,null,null,null,null,null,null,null,null,null,null,68]
[null,null,106,"06634005","Fritzlar",null,null,null,null,null,null,"Lautertal (Vogelsberg)",null,null,null,null,null,null,null,null,null,null,null,null,null,null,null,null,null,null,null,null,null,null,null,null,null,null,null,null,null,null,null,null,null,null,null,null,null,null,null,null,null,null,null,null,null,null,null,null,null,null,null,null,null,null,null,null,null,null,null,null,null,null,null,null,null,null,null,69,null,null,null,null,null,null,null,null,null,null,null,null,null,null,null,null,null,null,null,null,null,null,null,null,null,null,null,null,null,null,null,null,null,null,null,null,null,null,null,null,null,null,null,null,null,null,null,null,null,null,null,null,null,null,null,null,null,null,null,null,null,null,null,null,null,null,null,null,null,null,null,null,null,null,null,null,null,null,null,null,null,null,null,null,null,null,null,null,null,null,null,null,null,null,null,null,null,null,null,69]
[null,null,107,"06634006","Gilserberg",null,null,null,null,null,null,"Lich",null,null,null,null,null,null,null,null,null,null,null,null,null,null,null,null,null,null,null,null,null,null,null,null,null,null,null,29,null,null,null,null,null,null,null,null,null,null,null,null,null,null,null,null,null,null,null,null,null,null,null,null,null,null,null,null,null,null,null,null,null,null,null,null,null,null,null,null,null,null,null,null,null,null,null,null,null,null,null,null,null,null,null,null,null,null,null,null,null,null,null,null,null,null,null,null,null,null,null,null,null,null,null,null,null,null,null,null,null,null,null,null,null,null,null,null,null,null,null,null,null,null,null,null,null,null,null,null,null,null,null,null,null,null,null,null,null,null,null,null,null,null,null,null,null,null,null,null,null,null,null,null,null,null,null,null,null,null,null,null,null,null,null,null,null,null,null,29]
[null,null,108,"06634007","Gudensberg",null,null,null,null,null,null,"Lichtenfels",null,null,null,null,null,null,null,null,null,null,null,null,null,null,null,null,null,null,null,null,null,null,null,null,null,null,null,null,null,null,null,null,null,null,null,null,null,null,null,null,null,null,null,null,null,null,null,null,null,null,null,null,null,null,null,null,null,null,null,null,null,null,null,null,null,null,null,null,null,null,null,null,null,null,null,null,null,null,null,null,null,null,null,null,null,null,null,null,null,null,null,null,null,null,null,null,null,null,null,null,null,null,null,null,null,null,null,null,null,null,null,null,null,null,null,null,null,null,null,null,null,null,null,null,null,null,null,null,null,null,null,null,null,null,null,null,null,null,null,null,null,null,null,145,null,null,null,null,null,null,null,null,null,null,null,null,null,null,null,null,null,null,null,null,null,null,null,145]
[null,null,109,"06634008","Guxhagen",null,null,null,null,null,null,"Limburg an der Lahn",null,null,null,null,null,null,null,null,null,null,null,null,null,null,null,null,null,null,null,null,null,null,null,null,null,null,null,null,null,null,null,null,null,null,null,null,null,null,null,null,null,null,null,null,46,null,null,null,null,null,null,null,null,null,null,null,null,null,null,null,null,null,null,null,null,null,null,null,null,null,null,null,null,null,null,null,null,null,null,null,null,null,null,null,null,null,null,null,null,null,null,null,null,null,null,null,null,null,null,null,null,null,null,null,null,null,null,null,null,null,null,null,null,null,null,null,null,null,null,null,null,null,null,null,null,null,null,null,null,null,null,null,null,null,null,null,null,null,null,null,null,null,null,null,null,null,null,null,null,null,null,null,null,null,null,null,null,null,null,null,null,null,null,null,null,null,null,46]
[null,null,110,"06634009","Homberg (Efze)",null,null,null,null,null,null,"Linden",null,null,null,null,null,null,null,null,null,null,null,null,null,null,null,null,null,null,null,null,null,null,null,null,null,null,null,null,30,null,null,null,null,null,null,null,null,null,null,null,null,null,null,null,null,null,null,null,null,null,null,null,null,null,null,null,null,null,null,null,null,null,null,null,null,null,null,null,null,null,null,null,null,null,null,null,null,null,null,null,null,null,null,null,null,null,null,null,null,null,null,null,null,null,null,null,null,null,null,null,null,null,null,null,null,null,null,null,null,null,null,null,null,null,null,null,null,null,null,null,null,null,null,null,null,null,null,null,null,null,null,null,null,null,null,null,null,null,null,null,null,null,null,null,null,null,null,null,null,null,null,null,null,null,null,null,null,null,null,null,null,null,null,null,null,null,null,30]
[null,null,111,"06634010","Jesberg",null,null,null,null,null,null,"LK Fulda",null,null,null,null,null,null,null,null,null,null,null,null,null,null,null,null,null,null,null,null,null,null,null,null,null,null,null,null,null,null,null,null,null,null,null,null,null,null,null,null,null,null,null,null,null,null,null,null,null,null,null,null,null,null,null,null,null,null,null,null,null,null,null,null,null,null,null,null,null,null,null,null,null,null,null,77,null,null,null,null,null,null,null,null,null,null,null,null,null,null,null,null,null,null,null,null,null,null,null,null,null,null,null,null,null,null,null,null,null,null,null,null,null,null,null,null,null,null,null,null,null,null,null,null,null,null,null,null,null,null,null,null,null,null,null,null,null,null,null,null,null,null,null,null,null,null,null,null,null,null,null,null,null,null,null,null,null,null,null,null,null,null,null,null,null,null,null,77]
[null,null,112,"06634011","Knüllwald",null,null,null,null,null,null,"LK Gießen",null,null,null,null,null,null,null,null,null,null,null,null,null,null,null,null,18,null,null,null,null,null,null,null,null,null,null,null,null,null,null,null,null,null,null,null,null,null,null,null,null,null,null,null,null,null,null,null,null,null,null,null,null,null,null,null,null,null,null,null,null,null,null,null,null,null,null,null,null,null,null,null,null,null,null,null,null,null,null,null,null,null,null,null,null,null,null,null,null,null,null,null,null,null,null,null,null,null,null,null,null,null,null,null,null,null,null,null,null,null,null,null,null,null,null,null,null,null,null,null,null,null,null,null,null,null,null,null,null,null,null,null,null,null,null,null,null,null,null,null,null,null,null,null,null,null,null,null,null,null,null,null,null,null,null,null,null,null,null,null,null,null,null,null,null,null,null,18]
[null,null,113,"06634012","Körle",null,null,null,null,null,null,"LK Limburg-Weilburg",null,null,null,null,null,null,null,null,null,null,null,null,null,null,null,null,null,null,null,null,null,null,null,null,null,null,null,null,null,null,null,null,null,null,null,37,null,null,null,null,null,null,null,null,null,null,null,null,null,null,null,null,null,null,null,null,null,null,null,null,null,null,null,null,null,null,null,null,null,null,null,null,null,null,null,null,null,null,null,null,null,null,null,null,null,null,null,null,null,null,null,null,null,null,null,null,null,null,null,null,null,null,null,null,null,null,null,null,null,null,null,null,null,null,null,null,null,null,null,null,null,null,null,null,null,null,null,null,null,null,null,null,null,null,null,null,null,null,null,null,null,null,null,null,null,null,null,null,null,null,null,null,null,null,null,null,null,null,null,null,null,null,null,null,null,null,null,37]
[null,null,114,"06634013","Malsfeld",null,null,null,null,null,null,"LK Odenwald",2,null,null,null,null,null,null,null,null,null,null,null,null,null,null,null,null,null,null,null,null,null,null,null,null,null,null,null,null,null,null,null,null,null,null,null,null,null,null,null,null,null,null,null,null,null,null,null,null,null,null,null,null,null,null,null,null,null,null,null,null,null,null,null,null,null,null,null,null,null,null,null,null,null,null,null,null,null,null,null,null,null,null,null,null,null,null,null,null,null,null,null,null,null,null,null,null,null,null,null,null,null,null,null,null,null,null,null,null,null,null,null,null,null,null,null,null,null,null,null,null,null,null,null,null,null,null,null,null,null,null,null,null,null,null,null,null,null,null,null,null,null,null,null,null,null,null,null,null,null,null,null,null,null,null,null,null,null,null,null,null,null,null,null,null,null,null,2]
[null,null,115,"06634014","Melsungen",null,null,null,null,null,null,"LK Schwalm-Eder",null,null,null,null,null,null,null,null,null,null,null,null,null,null,null,null,null,null,null,null,null,null,null,null,null,null,null,null,null,null,null,null,null,null,null,null,null,null,null,null,null,null,null,null,null,null,null,null,null,null,null,null,null,null,null,null,null,null,null,null,null,null,null,null,null,null,null,null,null,null,null,null,null,null,null,null,null,null,null,null,null,null,null,null,null,null,null,null,null,null,null,null,null,null,null,null,null,null,null,101,null,null,null,null,null,null,null,null,null,null,null,null,null,null,null,null,null,null,null,null,null,null,null,null,null,null,null,null,null,null,null,null,null,null,null,null,null,null,null,null,null,null,null,null,null,null,null,null,null,null,null,null,null,null,null,null,null,null,null,null,null,null,null,null,null,null,null,101]
[null,null,116,"06634015","Morschen",null,null,null,null,null,null,"LK Vogelsberg",null,null,null,null,null,null,null,null,null,null,null,null,null,null,null,null,null,null,null,null,null,null,null,null,null,null,null,null,null,null,null,null,null,null,null,null,null,null,null,null,null,null,null,null,null,null,null,null,null,null,null,null,null,null,null,57,null,null,null,null,null,null,null,null,null,null,null,null,null,null,null,null,null,null,null,null,null,null,null,null,null,null,null,null,null,null,null,null,null,null,null,null,null,null,null,null,null,null,null,null,null,null,null,null,null,null,null,null,null,null,null,null,null,null,null,null,null,null,null,null,null,null,null,null,null,null,null,null,null,null,null,null,null,null,null,null,null,null,null,null,null,null,null,null,null,null,null,null,null,null,null,null,null,null,null,null,null,null,null,null,null,null,null,null,null,null,null,57]
[null,null,117,"06634016","Neuental",null,null,null,null,null,null,"LK Waldeck-Frankenberg",null,null,null,null,null,null,null,null,null,null,null,null,null,null,null,null,null,null,null,null,null,null,null,null,null,null,null,null,null,null,null,null,null,null,null,null,null,null,null,null,null,null,null,null,null,null,null,null,null,null,null,null,null,null,null,null,null,null,null,null,null,null,null,null,null,null,null,null,null,null,null,null,null,null,null,null,null,null,null,null,null,null,null,null,null,null,null,null,null,null,null,null,null,null,null,null,null,null,null,null,null,null,null,null,null,null,null,null,null,null,null,null,null,null,null,null,null,null,null,null,null,null,null,null,null,null,null,129,null,null,null,null,null,null,null,null,null,null,null,null,null,null,null,null,null,null,null,null,null,null,null,null,null,null,null,null,null,null,null,null,null,null,null,null,null,null,null,129]
[null,null,118,"06634017","Neukirchen",null,null,null,null,null,null,"LK Werra-Meißner",null,null,null,null,null,null,null,null,null,null,null,null,null,null,null,null,null,null,null,null,null,null,null,null,null,null,null,null,null,null,null,null,null,null,null,null,null,null,null,null,null,null,null,null,null,null,null,null,null,null,null,null,null,null,null,null,null,null,null,null,null,null,null,null,null,null,null,null,null,null,null,null,null,null,null,null,null,null,null,null,null,null,null,null,null,null,null,null,null,null,null,null,null,null,null,null,null,null,null,null,null,null,null,null,null,null,null,null,null,null,null,null,null,null,null,null,null,null,null,null,null,null,null,null,null,null,null,null,null,null,null,null,null,null,null,null,null,null,null,null,null,null,null,null,null,null,null,null,null,null,152,null,null,null,null,null,null,null,null,null,null,null,null,null,null,null,null,152]
[null,null,119,"06634018","Niedenstein",null,null,null,null,null,null,"Löhnberg",null,null,null,null,null,null,null,null,null,null,null,null,null,null,null,null,null,null,null,null,null,null,null,null,null,null,null,null,null,null,null,null,null,null,null,null,null,null,null,null,null,null,null,null,null,47,null,null,null,null,null,null,null,null,null,null,null,null,null,null,null,null,null,null,null,null,null,null,null,null,null,null,null,null,null,null,null,null,null,null,null,null,null,null,null,null,null,null,null,null,null,null,null,null,null,null,null,null,null,null,null,null,null,null,null,null,null,null,null,null,null,null,null,null,null,null,null,null,null,null,null,null,null,null,null,null,null,null,null,null,null,null,null,null,null,null,null,null,null,null,null,null,null,null,null,null,null,null,null,null,null,null,null,null,null,null,null,null,null,null,null,null,null,null,null,null,null,47]
[null,null,120,"06634019","Oberaula",null,null,null,null,null,null,"Lollar",null,null,null,null,null,null,null,null,null,null,null,null,null,null,null,null,null,null,null,null,null,null,null,null,null,null,null,null,null,31,null,null,null,null,null,null,null,null,null,null,null,null,null,null,null,null,null,null,null,null,null,null,null,null,null,null,null,null,null,null,null,null,null,null,null,null,null,null,null,null,null,null,null,null,null,null,null,null,null,null,null,null,null,null,null,null,null,null,null,null,null,null,null,null,null,null,null,null,null,null,null,null,null,null,null,null,null,null,null,null,null,null,null,null,null,null,null,null,null,null,null,null,null,null,null,null,null,null,null,null,null,null,null,null,null,null,null,null,null,null,null,null,null,null,null,null,null,null,null,null,null,null,null,null,null,null,null,null,null,null,null,null,null,null,null,null,null,31]
[null,null,121,"06634020","Ottrau",null,null,null,null,null,null,"Lützelbach",null,null,null,null,null,null,null,null,null,null,12,null,null,null,null,null,null,null,null,null,null,null,null,null,null,null,null,null,null,null,null,null,null,null,null,null,null,null,null,null,null,null,null,null,null,null,null,null,null,null,null,null,null,null,null,null,null,null,null,null,null,null,null,null,null,null,null,null,null,null,null,null,null,null,null,null,null,null,null,null,null,null,null,null,null,null,null,null,null,null,null,null,null,null,null,null,null,null,null,null,null,null,null,null,null,null,null,null,null,null,null,null,null,null,null,null,null,null,null,null,null,null,null,null,null,null,null,null,null,null,null,null,null,null,null,null,null,null,null,null,null,null,null,null,null,null,null,null,null,null,null,null,null,null,null,null,null,null,null,null,null,null,null,null,null,null,null,12]
[null,null,122,"06634021","Schrecksbach",null,null,null,null,null,null,"Malsfeld",null,null,null,null,null,null,null,null,null,null,null,null,null,null,null,null,null,null,null,null,null,null,null,null,null,null,null,null,null,null,null,null,null,null,null,null,null,null,null,null,null,null,null,null,null,null,null,null,null,null,null,null,null,null,null,null,null,null,null,null,null,null,null,null,null,null,null,null,null,null,null,null,null,null,null,null,null,null,null,null,null,null,null,null,null,null,null,null,null,null,null,null,null,null,null,null,null,null,null,null,null,null,null,null,null,null,null,null,null,null,null,null,114,null,null,null,null,null,null,null,null,null,null,null,null,null,null,null,null,null,null,null,null,null,null,null,null,null,null,null,null,null,null,null,null,null,null,null,null,null,null,null,null,null,null,null,null,null,null,null,null,null,null,null,null,null,null,114]
[null,null,123,"06634022","Schwalmstadt",null,null,null,null,null,null,"Meinhard",null,null,null,null,null,null,null,null,null,null,null,null,null,null,null,null,null,null,null,null,null,null,null,null,null,null,null,null,null,null,null,null,null,null,null,null,null,null,null,null,null,null,null,null,null,null,null,null,null,null,null,null,null,null,null,null,null,null,null,null,null,null,null,null,null,null,null,null,null,null,null,null,null,null,null,null,null,null,null,null,null,null,null,null,null,null,null,null,null,null,null,null,null,null,null,null,null,null,null,null,null,null,null,null,null,null,null,null,null,null,null,null,null,null,null,null,null,null,null,null,null,null,null,null,null,null,null,null,null,null,null,null,null,null,null,null,null,null,null,null,null,null,null,null,null,null,null,null,null,null,null,null,null,null,null,null,null,159,null,null,null,null,null,null,null,null,null,159]
[null,null,124,"06634023","Schwarzenborn",null,null,null,null,null,null,"Meißner",null,null,null,null,null,null,null,null,null,null,null,null,null,null,null,null,null,null,null,null,null,null,null,null,null,null,null,null,null,null,null,null,null,null,null,null,null,null,null,null,null,null,null,null,null,null,null,null,null,null,null,null,null,null,null,null,null,null,null,null,null,null,null,null,null,null,null,null,null,null,null,null,null,null,null,null,null,null,null,null,null,null,null,null,null,null,null,null,null,null,null,null,null,null,null,null,null,null,null,null,null,null,null,null,null,null,null,null,null,null,null,null,null,null,null,null,null,null,null,null,null,null,null,null,null,null,null,null,null,null,null,null,null,null,null,null,null,null,null,null,null,null,null,null,null,null,null,null,null,null,null,null,null,null,null,null,null,null,160,null,null,null,null,null,null,null,null,160]
[null,null,125,"06634024","Spangenberg",null,null,null,null,null,null,"Melsungen",null,null,null,null,null,null,null,null,null,null,null,null,null,null,null,null,null,null,null,null,null,null,null,null,null,null,null,null,null,null,null,null,null,null,null,null,null,null,null,null,null,null,null,null,null,null,null,null,null,null,null,null,null,null,null,null,null,null,null,null,null,null,null,null,null,null,null,null,null,null,null,null,null,null,null,null,null,null,null,null,null,null,null,null,null,null,null,null,null,null,null,null,null,null,null,null,null,null,null,null,null,null,null,null,null,null,null,null,null,null,null,null,null,115,null,null,null,null,null,null,null,null,null,null,null,null,null,null,null,null,null,null,null,null,null,null,null,null,null,null,null,null,null,null,null,null,null,null,null,null,null,null,null,null,null,null,null,null,null,null,null,null,null,null,null,null,null,115]
[null,null,126,"06634025","Wabern",null,null,null,null,null,null,"Mengerskirchen",null,null,null,null,null,null,null,null,null,null,null,null,null,null,null,null,null,null,null,null,null,null,null,null,null,null,null,null,null,null,null,null,null,null,null,null,null,null,null,null,null,null,null,null,null,null,48,null,null,null,null,null,null,null,null,null,null,null,null,null,null,null,null,null,null,null,null,null,null,null,null,null,null,null,null,null,null,null,null,null,null,null,null,null,null,null,null,null,null,null,null,null,null,null,null,null,null,null,null,null,null,null,null,null,null,null,null,null,null,null,null,null,null,null,null,null,null,null,null,null,null,null,null,null,null,null,null,null,null,null,null,null,null,null,null,null,null,null,null,null,null,null,null,null,null,null,null,null,null,null,null,null,null,null,null,null,null,null,null,null,null,null,null,null,null,null,null,48]
[null,null,127,"06634026","Willingshausen",null,null,null,null,null,null,"Merenberg",null,null,null,null,null,null,null,null,null,null,null,null,null,null,null,null,null,null,null,null,null,null,null,null,null,null,null,null,null,null,null,null,null,null,null,null,null,null,null,null,null,null,null,null,null,null,null,49,null,null,null,null,null,null,null,null,null,null,null,null,null,null,null,null,null,null,null,null,null,null,null,null,null,null,null,null,null,null,null,null,null,null,null,null,null,null,null,null,null,null,null,null,null,null,null,null,null,null,null,null,null,null,null,null,null,null,null,null,null,null,null,null,null,null,null,null,null,null,null,null,null,null,null,null,null,null,null,null,null,null,null,null,null,null,null,null,null,null,null,null,null,null,null,null,null,null,null,null,null,null,null,null,null,null,null,null,null,null,null,null,null,null,null,null,null,null,null,49]
[null,null,128,"06634027","Bad Zwesten",null,null,null,null,null,null,"Michelstadt",null,null,null,null,null,null,null,null,null,null,null,13,null,null,null,null,null,null,null,null,null,null,null,null,null,null,null,null,null,null,null,null,null,null,null,null,null,null,null,null,null,null,null,null,null,null,null,null,null,null,null,null,null,null,null,null,null,null,null,null,null,null,null,null,null,null,null,null,null,null,null,null,null,null,null,null,null,null,null,null,null,null,null,null,null,null,null,null,null,null,null,null,null,null,null,null,null,null,null,null,null,null,null,null,null,null,null,null,null,null,null,null,null,null,null,null,null,null,null,null,null,null,null,null,null,null,null,null,null,null,null,null,null,null,null,null,null,null,null,null,null,null,null,null,null,null,null,null,null,null,null,null,null,null,null,null,null,null,null,null,null,null,null,null,null,null,null,13]
[null,null,129,"06635000","LK Waldeck-Frankenberg",null,null,null,null,null,null,"Morschen",null,null,null,null,null,null,null,null,null,null,null,null,null,null,null,null,null,null,null,null,null,null,null,null,null,null,null,null,null,null,null,null,null,null,null,null,null,null,null,null,null,null,null,null,null,null,null,null,null,null,null,null,null,null,null,null,null,null,null,null,null,null,null,null,null,null,null,null,null,null,null,null,null,null,null,null,null,null,null,null,null,null,null,null,null,null,null,null,null,null,null,null,null,null,null,null,null,null,null,null,null,null,null,null,null,null,null,null,null,null,null,null,null,null,116,null,null,null,null,null,null,null,null,null,null,null,null,null,null,null,null,null,null,null,null,null,null,null,null,null,null,null,null,null,null,null,null,null,null,null,null,null,null,null,null,null,null,null,null,null,null,null,null,null,null,null,null,116]
[null,null,130,"06635001","Allendorf (Eder)",null,null,null,null,null,null,"Mossautal",null,null,null,null,null,null,null,null,null,null,null,null,14,null,null,null,null,null,null,null,null,null,null,null,null,null,null,null,null,null,null,null,null,null,null,null,null,null,null,null,null,null,null,null,null,null,null,null,null,null,null,null,null,null,null,null,null,null,null,null,null,null,null,null,null,null,null,null,null,null,null,null,null,null,null,null,null,null,null,null,null,null,null,null,null,null,null,null,null,null,null,null,null,null,null,null,null,null,null,null,null,null,null,null,null,null,null,null,null,null,null,null,null,null,null,null,null,null,null,null,null,null,null,null,null,null,null,null,null,null,null,null,null,null,null,null,null,null,null,null,null,null,null,null,null,null,null,null,null,null,null,null,null,null,null,null,null,null,null,null,null,null,null,null,null,null,null,14]
[null,null,131,"06635002","Bad Arolsen",null,null,null,null,null,null,"Mücke",null,null,null,null,null,null,null,null,null,null,null,null,null,null,null,null,null,null,null,null,null,null,null,null,null,null,null,null,null,null,null,null,null,null,null,null,null,null,null,null,null,null,null,null,null,null,null,null,null,null,null,null,null,null,null,null,null,null,null,null,null,null,null,null,null,null,null,null,70,null,null,null,null,null,null,null,null,null,null,null,null,null,null,null,null,null,null,null,null,null,null,null,null,null,null,null,null,null,null,null,null,null,null,null,null,null,null,null,null,null,null,null,null,null,null,null,null,null,null,null,null,null,null,null,null,null,null,null,null,null,null,null,null,null,null,null,null,null,null,null,null,null,null,null,null,null,null,null,null,null,null,null,null,null,null,null,null,null,null,null,null,null,null,null,null,null,null,70]
[null,null,132,"06635003","Bad Wildungen",null,null,null,null,null,null,"Neu-Eichenberg",null,null,null,null,null,null,null,null,null,null,null,null,null,null,null,null,null,null,null,null,null,null,null,null,null,null,null,null,null,null,null,null,null,null,null,null,null,null,null,null,null,null,null,null,null,null,null,null,null,null,null,null,null,null,null,null,null,null,null,null,null,null,null,null,null,null,null,null,null,null,null,null,null,null,null,null,null,null,null,null,null,null,null,null,null,null,null,null,null,null,null,null,null,null,null,null,null,null,null,null,null,null,null,null,null,null,null,null,null,null,null,null,null,null,null,null,null,null,null,null,null,null,null,null,null,null,null,null,null,null,null,null,null,null,null,null,null,null,null,null,null,null,null,null,null,null,null,null,null,null,null,null,null,null,null,null,null,null,null,161,null,null,null,null,null,null,null,161]
[null,null,133,"06635004","Battenberg (Eder)",null,null,null,null,null,null,"Neuental",null,null,null,null,null,null,null,null,null,null,null,null,null,null,null,null,null,null,null,null,null,null,null,null,null,null,null,null,null,null,null,null,null,null,null,null,null,null,null,null,null,null,null,null,null,null,null,null,null,null,null,null,null,null,null,null,null,null,null,null,null,null,null,null,null,null,null,null,null,null,null,null,null,null,null,null,null,null,null,null,null,null,null,null,null,null,null,null,null,null,null,null,null,null,null,null,null,null,null,null,null,null,null,null,null,null,null,null,null,null,null,null,null,null,null,117,null,null,null,null,null,null,null,null,null,null,null,null,null,null,null,null,null,null,null,null,null,null,null,null,null,null,null,null,null,null,null,null,null,null,null,null,null,null,null,null,null,null,null,null,null,null,null,null,null,null,null,117]
[null,null,134,"06635005","Bromskirchen",null,null,null,null,null,null,"Neuhof",null,null,null,null,null,null,null,null,null,null,null,null,null,null,null,null,null,null,null,null,null,null,null,null,null,null,null,null,null,null,null,null,null,null,null,null,null,null,null,null,null,null,null,null,null,null,null,null,null,null,null,null,null,null,null,null,null,null,null,null,null,null,null,null,null,null,null,null,null,null,null,null,null,null,null,null,null,null,null,null,null,null,null,null,null,null,null,null,null,null,null,null,null,95,null,null,null,null,null,null,null,null,null,null,null,null,null,null,null,null,null,null,null,null,null,null,null,null,null,null,null,null,null,null,null,null,null,null,null,null,null,null,null,null,null,null,null,null,null,null,null,null,null,null,null,null,null,null,null,null,null,null,null,null,null,null,null,null,null,null,null,null,null,null,null,null,null,95]
[null,null,135,"06635006","Burgwald",null,null,null,null,null,null,"Neukirchen",null,null,null,null,null,null,null,null,null,null,null,null,null,null,null,null,null,null,null,null,null,null,null,null,null,null,null,null,null,null,null,null,null,null,null,null,null,null,null,null,null,null,null,null,null,null,null,null,null,null,null,null,null,null,null,null,null,null,null,null,null,null,null,null,null,null,null,null,null,null,null,null,null,null,null,null,null,null,null,null,null,null,null,null,null,null,null,null,null,null,null,null,null,null,null,null,null,null,null,null,null,null,null,null,null,null,null,null,null,null,null,null,null,null,null,null,118,null,null,null,null,null,null,null,null,null,null,null,null,null,null,null,null,null,null,null,null,null,null,null,null,null,null,null,null,null,null,null,null,null,null,null,null,null,null,null,null,null,null,null,null,null,null,null,null,null,null,118]
[null,null,136,"06635007","Diemelsee",null,null,null,null,null,null,"Niedenstein",null,null,null,null,null,null,null,null,null,null,null,null,null,null,null,null,null,null,null,null,null,null,null,null,null,null,null,null,null,null,null,null,null,null,null,null,null,null,null,null,null,null,null,null,null,null,null,null,null,null,null,null,null,null,null,null,null,null,null,null,null,null,null,null,null,null,null,null,null,null,null,null,null,null,null,null,null,null,null,null,null,null,null,null,null,null,null,null,null,null,null,null,null,null,null,null,null,null,null,null,null,null,null,null,null,null,null,null,null,null,null,null,null,null,null,null,null,119,null,null,null,null,null,null,null,null,null,null,null,null,null,null,null,null,null,null,null,null,null,null,null,null,null,null,null,null,null,null,null,null,null,null,null,null,null,null,null,null,null,null,null,null,null,null,null,null,null,119]
[null,null,137,"06635008","Diemelstadt",null,null,null,null,null,null,"Nüsttal",null,null,null,null,null,null,null,null,null,null,null,null,null,null,null,null,null,null,null,null,null,null,null,null,null,null,null,null,null,null,null,null,null,null,null,null,null,null,null,null,null,null,null,null,null,null,null,null,null,null,null,null,null,null,null,null,null,null,null,null,null,null,null,null,null,null,null,null,null,null,null,null,null,null,null,null,null,null,null,null,null,null,null,null,null,null,null,null,null,null,null,null,null,null,96,null,null,null,null,null,null,null,null,null,null,null,null,null,null,null,null,null,null,null,null,null,null,null,null,null,null,null,null,null,null,null,null,null,null,null,null,null,null,null,null,null,null,null,null,null,null,null,null,null,null,null,null,null,null,null,null,null,null,null,null,null,null,null,null,null,null,null,null,null,null,null,null,96]
[null,null,138,"06635009","Edertal",null,null,null,null,null,null,"Oberaula",null,null,null,null,null,null,null,null,null,null,null,null,null,null,null,null,null,null,null,null,null,null,null,null,null,null,null,null,null,null,null,null,null,null,null,null,null,null,null,null,null,null,null,null,null,null,null,null,null,null,null,null,null,null,null,null,null,null,null,null,null,null,null,null,null,null,null,null,null,null,null,null,null,null,null,null,null,null,null,null,null,null,null,null,null,null,null,null,null,null,null,null,null,null,null,null,null,null,null,null,null,null,null,null,null,null,null,null,null,null,null,null,null,null,null,null,null,null,120,null,null,null,null,null,null,null,null,null,null,null,null,null,null,null,null,null,null,null,null,null,null,null,null,null,null,null,null,null,null,null,null,null,null,null,null,null,null,null,null,null,null,null,null,null,null,null,null,120]
[null,null,139,"06635010","Frankenau",null,null,null,null,null,null,"Ottrau",null,null,null,null,null,null,null,null,null,null,null,null,null,null,null,null,null,null,null,null,null,null,null,null,null,null,null,null,null,null,null,null,null,null,null,null,null,null,null,null,null,null,null,null,null,null,null,null,null,null,null,null,null,null,null,null,null,null,null,null,null,null,null,null,null,null,null,null,null,null,null,null,null,null,null,null,null,null,null,null,null,null,null,null,null,null,null,null,null,null,null,null,null,null,null,null,null,null,null,null,null,null,null,null,null,null,null,null,null,null,null,null,null,null,null,null,null,null,null,121,null,null,null,null,null,null,null,null,null,null,null,null,null,null,null,null,null,null,null,null,null,null,null,null,null,null,null,null,null,null,null,null,null,null,null,null,null,null,null,null,null,null,null,null,null,null,null,121]
[null,null,140,"06635011","Frankenberg (Eder)",null,null,null,null,null,null,"Petersberg",null,null,null,null,null,null,null,null,null,null,null,null,null,null,null,null,null,null,null,null,null,null,null,null,null,null,null,null,null,null,null,null,null,null,null,null,null,null,null,null,null,null,null,null,null,null,null,null,null,null,null,null,null,null,null,null,null,null,null,null,null,null,null,null,null,null,null,null,null,null,null,null,null,null,null,null,null,null,null,null,null,null,null,null,null,null,null,null,null,null,null,null,null,null,null,97,null,null,null,null,null,null,null,null,null,null,null,null,null,null,null,null,null,null,null,null,null,null,null,null,null,null,null,null,null,null,null,null,null,null,null,null,null,null,null,null,null,null,null,null,null,null,null,null,null,null,null,null,null,null,null,null,null,null,null,null,null,null,null,null,null,null,null,null,null,null,null,97]
[null,null,141,"06635012","Gemünden (Wohra)",null,null,null,null,null,null,"Pohlheim",null,null,null,null,null,null,null,null,null,null,null,null,null,null,null,null,null,null,null,null,null,null,null,null,null,null,null,null,null,null,32,null,null,null,null,null,null,null,null,null,null,null,null,null,null,null,null,null,null,null,null,null,null,null,null,null,null,null,null,null,null,null,null,null,null,null,null,null,null,null,null,null,null,null,null,null,null,null,null,null,null,null,null,null,null,null,null,null,null,null,null,null,null,null,null,null,null,null,null,null,null,null,null,null,null,null,null,null,null,null,null,null,null,null,null,null,null,null,null,null,null,null,null,null,null,null,null,null,null,null,null,null,null,null,null,null,null,null,null,null,null,null,null,null,null,null,null,null,null,null,null,null,null,null,null,null,null,null,null,null,null,null,null,null,null,null,null,32]
[null,null,142,"06635013","Haina (Kloster)",null,null,null,null,null,null,"Poppenhausen (Wasserkuppe) ",null,null,null,null,null,null,null,null,null,null,null,null,null,null,null,null,null,null,null,null,null,null,null,null,null,null,null,null,null,null,null,null,null,null,null,null,null,null,null,null,null,null,null,null,null,null,null,null,null,null,null,null,null,null,null,null,null,null,null,null,null,null,null,null,null,null,null,null,null,null,null,null,null,null,null,null,null,null,null,null,null,null,null,null,null,null,null,null,null,null,null,null,null,null,null,null,98,null,null,null,null,null,null,null,null,null,null,null,null,null,null,null,null,null,null,null,null,null,null,null,null,null,null,null,null,null,null,null,null,null,null,null,null,null,null,null,null,null,null,null,null,null,null,null,null,null,null,null,null,null,null,null,null,null,null,null,null,null,null,null,null,null,null,null,null,null,null,98]
[null,null,143,"06635014","Hatzfeld (Eder)",null,null,null,null,null,null,"Rabenau",null,null,null,null,null,null,null,null,null,null,null,null,null,null,null,null,null,null,null,null,null,null,null,null,null,null,null,null,null,null,null,33,null,null,null,null,null,null,null,null,null,null,null,null,null,null,null,null,null,null,null,null,null,null,null,null,null,null,null,null,null,null,null,null,null,null,null,null,null,null,null,null,null,null,null,null,null,null,null,null,null,null,null,null,null,null,null,null,null,null,null,null,null,null,null,null,null,null,null,null,null,null,null,null,null,null,null,null,null,null,null,null,null,null,null,null,null,null,null,null,null,null,null,null,null,null,null,null,null,null,null,null,null,null,null,null,null,null,null,null,null,null,null,null,null,null,null,null,null,null,null,null,null,null,null,null,null,null,null,null,null,null,null,null,null,null,null,33]
[null,null,144,"06635015","Korbach",null,null,null,null,null,null,"Rasdorf",null,null,null,null,null,null,null,null,null,null,null,null,null,null,null,null,null,null,null,null,null,null,null,null,null,null,null,null,null,null,null,null,null,null,null,null,null,null,null,null,null,null,null,null,null,null,null,null,null,null,null,null,null,null,null,null,null,null,null,null,null,null,null,null,null,null,null,null,null,null,null,null,null,null,null,null,null,null,null,null,null,null,null,null,null,null,null,null,null,null,null,null,null,null,null,null,null,99,null,null,null,null,null,null,null,null,null,null,null,null,null,null,null,null,null,null,null,null,null,null,null,null,null,null,null,null,null,null,null,null,null,null,null,null,null,null,null,null,null,null,null,null,null,null,null,null,null,null,null,null,null,null,null,null,null,null,null,null,null,null,null,null,null,null,null,null,null,99]
[null,null,145,"06635016","Lichtenfels",null,null,null,null,null,null,"Reichelsheim (Odenwald)",null,null,null,null,null,null,null,null,null,null,null,null,null,15,null,null,null,null,null,null,null,null,null,null,null,null,null,null,null,null,null,null,null,null,null,null,null,null,null,null,null,null,null,null,null,null,null,null,null,null,null,null,null,null,null,null,null,null,null,null,null,null,null,null,null,null,null,null,null,null,null,null,null,null,null,null,null,null,null,null,null,null,null,null,null,null,null,null,null,null,null,null,null,null,null,null,null,null,null,null,null,null,null,null,null,null,null,null,null,null,null,null,null,null,null,null,null,null,null,null,null,null,null,null,null,null,null,null,null,null,null,null,null,null,null,null,null,null,null,null,null,null,null,null,null,null,null,null,null,null,null,null,null,null,null,null,null,null,null,null,null,null,null,null,null,null,null,15]
[null,null,146,"06635017","Rosenthal",null,null,null,null,null,null,"Reiskirchen",null,null,null,null,null,null,null,null,null,null,null,null,null,null,null,null,null,null,null,null,null,null,null,null,null,null,null,null,null,null,null,null,34,null,null,null,null,null,null,null,null,null,null,null,null,null,null,null,null,null,null,null,null,null,null,null,null,null,null,null,null,null,null,null,null,null,null,null,null,null,null,null,null,null,null,null,null,null,null,null,null,null,null,null,null,null,null,null,null,null,null,null,null,null,null,null,null,null,null,null,null,null,null,null,null,null,null,null,null,null,null,null,null,null,null,null,null,null,null,null,null,null,null,null,null,null,null,null,null,null,null,null,null,null,null,null,null,null,null,null,null,null,null,null,null,null,null,null,null,null,null,null,null,null,null,null,null,null,null,null,null,null,null,null,null,null,null,34]
[null,null,147,"06635018","Twistetal",null,null,null,null,null,null,"Ringgau",null,null,null,null,null,null,null,null,null,null,null,null,null,null,null,null,null,null,null,null,null,null,null,null,null,null,null,null,null,null,null,null,null,null,null,null,null,null,null,null,null,null,null,null,null,null,null,null,null,null,null,null,null,null,null,null,null,null,null,null,null,null,null,null,null,null,null,null,null,null,null,null,null,null,null,null,null,null,null,null,null,null,null,null,null,null,null,null,null,null,null,null,null,null,null,null,null,null,null,null,null,null,null,null,null,null,null,null,null,null,null,null,null,null,null,null,null,null,null,null,null,null,null,null,null,null,null,null,null,null,null,null,null,null,null,null,null,null,null,null,null,null,null,null,null,null,null,null,null,null,null,null,null,null,null,null,null,null,null,null,162,null,null,null,null,null,null,162]
[null,null,148,"06635019","Vöhl",null,null,null,null,null,null,"Romrod",null,null,null,null,null,null,null,null,null,null,null,null,null,null,null,null,null,null,null,null,null,null,null,null,null,null,null,null,null,null,null,null,null,null,null,null,null,null,null,null,null,null,null,null,null,null,null,null,null,null,null,null,null,null,null,null,null,null,null,null,null,null,null,null,null,null,null,null,null,71,null,null,null,null,null,null,null,null,null,null,null,null,null,null,null,null,null,null,null,null,null,null,null,null,null,null,null,null,null,null,null,null,null,null,null,null,null,null,null,null,null,null,null,null,null,null,null,null,null,null,null,null,null,null,null,null,null,null,null,null,null,null,null,null,null,null,null,null,null,null,null,null,null,null,null,null,null,null,null,null,null,null,null,null,null,null,null,null,null,null,null,null,null,null,null,null,null,71]
[null,null,149,"06635020","Volkmarsen",null,null,null,null,null,null,"Rosenthal",null,null,null,null,null,null,null,null,null,null,null,null,null,null,null,null,null,null,null,null,null,null,null,null,null,null,null,null,null,null,null,null,null,null,null,null,null,null,null,null,null,null,null,null,null,null,null,null,null,null,null,null,null,null,null,null,null,null,null,null,null,null,null,null,null,null,null,null,null,null,null,null,null,null,null,null,null,null,null,null,null,null,null,null,null,null,null,null,null,null,null,null,null,null,null,null,null,null,null,null,null,null,null,null,null,null,null,null,null,null,null,null,null,null,null,null,null,null,null,null,null,null,null,null,null,null,null,null,null,null,null,null,null,null,null,null,null,null,null,null,null,null,null,null,146,null,null,null,null,null,null,null,null,null,null,null,null,null,null,null,null,null,null,null,null,null,null,146]
[null,null,150,"06635021","Waldeck",null,null,null,null,null,null,"Rothenberg",null,null,null,null,null,null,null,null,null,null,null,null,null,null,16,null,null,null,null,null,null,null,null,null,null,null,null,null,null,null,null,null,null,null,null,null,null,null,null,null,null,null,null,null,null,null,null,null,null,null,null,null,null,null,null,null,null,null,null,null,null,null,null,null,null,null,null,null,null,null,null,null,null,null,null,null,null,null,null,null,null,null,null,null,null,null,null,null,null,null,null,null,null,null,null,null,null,null,null,null,null,null,null,null,null,null,null,null,null,null,null,null,null,null,null,null,null,null,null,null,null,null,null,null,null,null,null,null,null,null,null,null,null,null,null,null,null,null,null,null,null,null,null,null,null,null,null,null,null,null,null,null,null,null,null,null,null,null,null,null,null,null,null,null,null,null,null,16]
[null,null,151,"06635022","Willingen (Upland)",null,null,null,null,null,null,"Runkel",null,null,null,null,null,null,null,null,null,null,null,null,null,null,null,null,null,null,null,null,null,null,null,null,null,null,null,null,null,null,null,null,null,null,null,null,null,null,null,null,null,null,null,null,null,null,null,null,50,null,null,null,null,null,null,null,null,null,null,null,null,null,null,null,null,null,null,null,null,null,null,null,null,null,null,null,null,null,null,null,null,null,null,null,null,null,null,null,null,null,null,null,null,null,null,null,null,null,null,null,null,null,null,null,null,null,null,null,null,null,null,null,null,null,null,null,null,null,null,null,null,null,null,null,null,null,null,null,null,null,null,null,null,null,null,null,null,null,null,null,null,null,null,null,null,null,null,null,null,null,null,null,null,null,null,null,null,null,null,null,null,null,null,null,null,null,null,50]
[null,null,152,"06636000","LK Werra-Meißner",null,null,null,null,null,null,"Schlitz",null,null,null,null,null,null,null,null,null,null,null,null,null,null,null,null,null,null,null,null,null,null,null,null,null,null,null,null,null,null,null,null,null,null,null,null,null,null,null,null,null,null,null,null,null,null,null,null,null,null,null,null,null,null,null,null,null,null,null,null,null,null,null,null,null,null,null,null,null,null,72,null,null,null,null,null,null,null,null,null,null,null,null,null,null,null,null,null,null,null,null,null,null,null,null,null,null,null,null,null,null,null,null,null,null,null,null,null,null,null,null,null,null,null,null,null,null,null,null,null,null,null,null,null,null,null,null,null,null,null,null,null,null,null,null,null,null,null,null,null,null,null,null,null,null,null,null,null,null,null,null,null,null,null,null,null,null,null,null,null,null,null,null,null,null,null,null,72]
[null,null,153,"06636001","Bad Sooden-Allendorf",null,null,null,null,null,null,"Schotten",null,null,null,null,null,null,null,null,null,null,null,null,null,null,null,null,null,null,null,null,null,null,null,null,null,null,null,null,null,null,null,null,null,null,null,null,null,null,null,null,null,null,null,null,null,null,null,null,null,null,null,null,null,null,null,null,null,null,null,null,null,null,null,null,null,null,null,null,null,null,null,73,null,null,null,null,null,null,null,null,null,null,null,null,null,null,null,null,null,null,null,null,null,null,null,null,null,null,null,null,null,null,null,null,null,null,null,null,null,null,null,null,null,null,null,null,null,null,null,null,null,null,null,null,null,null,null,null,null,null,null,null,null,null,null,null,null,null,null,null,null,null,null,null,null,null,null,null,null,null,null,null,null,null,null,null,null,null,null,null,null,null,null,null,null,null,null,73]
[null,null,154,"06636002","Berkatal",null,null,null,null,null,null,"Schrecksbach",null,null,null,null,null,null,null,null,null,null,null,null,null,null,null,null,null,null,null,null,null,null,null,null,null,null,null,null,null,null,null,null,null,null,null,null,null,null,null,null,null,null,null,null,null,null,null,null,null,null,null,null,null,null,null,null,null,null,null,null,null,null,null,null,null,null,null,null,null,null,null,null,null,null,null,null,null,null,null,null,null,null,null,null,null,null,null,null,null,null,null,null,null,null,null,null,null,null,null,null,null,null,null,null,null,null,null,null,null,null,null,null,null,null,null,null,null,null,null,null,122,null,null,null,null,null,null,null,null,null,null,null,null,null,null,null,null,null,null,null,null,null,null,null,null,null,null,null,null,null,null,null,null,null,null,null,null,null,null,null,null,null,null,null,null,null,null,122]
[null,null,155,"06636003","Eschwege",null,null,null,null,null,null,"Schwalmstadt",null,null,null,null,null,null,null,null,null,null,null,null,null,null,null,null,null,null,null,null,null,null,null,null,null,null,null,null,null,null,null,null,null,null,null,null,null,null,null,null,null,null,null,null,null,null,null,null,null,null,null,null,null,null,null,null,null,null,null,null,null,null,null,null,null,null,null,null,null,null,null,null,null,null,null,null,null,null,null,null,null,null,null,null,null,null,null,null,null,null,null,null,null,null,null,null,null,null,null,null,null,null,null,null,null,null,null,null,null,null,null,null,null,null,null,null,null,null,null,null,null,123,null,null,null,null,null,null,null,null,null,null,null,null,null,null,null,null,null,null,null,null,null,null,null,null,null,null,null,null,null,null,null,null,null,null,null,null,null,null,null,null,null,null,null,null,null,123]
[null,null,156,"06636004","Großalmerode",null,null,null,null,null,null,"Schwalmtal",null,null,null,null,null,null,null,null,null,null,null,null,null,null,null,null,null,null,null,null,null,null,null,null,null,null,null,null,null,null,null,null,null,null,null,null,null,null,null,null,null,null,null,null,null,null,null,null,null,null,null,null,null,null,null,null,null,null,null,null,null,null,null,null,null,null,null,null,null,null,null,null,74,null,null,null,null,null,null,null,null,null,null,null,null,null,null,null,null,null,null,null,null,null,null,null,null,null,null,null,null,null,null,null,null,null,null,null,null,null,null,null,null,null,null,null,null,null,null,null,null,null,null,null,null,null,null,null,null,null,null,null,null,null,null,null,null,null,null,null,null,null,null,null,null,null,null,null,null,null,null,null,null,null,null,null,null,null,null,null,null,null,null,null,null,null,null,74]
[null,null,157,"06636005","Herleshausen",null,null,null,null,null,null,"Schwarzenborn",null,null,null,null,null,null,null,null,null,null,null,null,null,null,null,null,null,null,null,null,null,null,null,null,null,null,null,null,null,null,null,null,null,null,null,null,null,null,null,null,null,null,null,null,null,null,null,null,null,null,null,null,null,null,null,null,null,null,null,null,null,null,null,null,null,null,null,null,null,null,null,null,null,null,null,null,null,null,null,null,null,null,null,null,null,null,null,null,null,null,null,null,null,null,null,null,null,null,null,null,null,null,null,null,null,null,null,null,null,null,null,null,null,null,null,null,null,null,null,null,null,null,124,null,null,null,null,null,null,null,null,null,null,null,null,null,null,null,null,null,null,null,null,null,null,null,null,null,null,null,null,null,null,null,null,null,null,null,null,null,null,null,null,null,null,null,null,124]
[null,null,158,"06636006","Hessisch Lichtenau",null,null,null,null,null,null,"Selters (Taunus)",null,null,null,null,null,null,null,null,null,null,null,null,null,null,null,null,null,null,null,null,null,null,null,null,null,null,null,null,null,null,null,null,null,null,null,null,null,null,null,null,null,null,null,null,null,null,null,null,null,51,null,null,null,null,null,null,null,null,null,null,null,null,null,null,null,null,null,null,null,null,null,null,null,null,null,null,null,null,null,null,null,null,null,null,null,null,null,null,null,null,null,null,null,null,null,null,null,null,null,null,null,null,null,null,null,null,null,null,null,null,null,null,null,null,null,null,null,null,null,null,null,null,null,null,null,null,null,null,null,null,null,null,null,null,null,null,null,null,null,null,null,null,null,null,null,null,null,null,null,null,null,null,null,null,null,null,null,null,null,null,null,null,null,null,null,null,null,51]
[null,null,159,"06636007","Meinhard",null,null,null,null,null,null,"Sensbachtal",null,null,null,null,null,null,null,null,null,null,null,null,null,null,null,17,null,null,null,null,null,null,null,null,null,null,null,null,null,null,null,null,null,null,null,null,null,null,null,null,null,null,null,null,null,null,null,null,null,null,null,null,null,null,null,null,null,null,null,null,null,null,null,null,null,null,null,null,null,null,null,null,null,null,null,null,null,null,null,null,null,null,null,null,null,null,null,null,null,null,null,null,null,null,null,null,null,null,null,null,null,null,null,null,null,null,null,null,null,null,null,null,null,null,null,null,null,null,null,null,null,null,null,null,null,null,null,null,null,null,null,null,null,null,null,null,null,null,null,null,null,null,null,null,null,null,null,null,null,null,null,null,null,null,null,null,null,null,null,null,null,null,null,null,null,null,null,17]
[null,null,160,"06636008","Meißner",null,null,null,null,null,null,"Sontra",null,null,null,null,null,null,null,null,null,null,null,null,null,null,null,null,null,null,null,null,null,null,null,null,null,null,null,null,null,null,null,null,null,null,null,null,null,null,null,null,null,null,null,null,null,null,null,null,null,null,null,null,null,null,null,null,null,null,null,null,null,null,null,null,null,null,null,null,null,null,null,null,null,null,null,null,null,null,null,null,null,null,null,null,null,null,null,null,null,null,null,null,null,null,null,null,null,null,null,null,null,null,null,null,null,null,null,null,null,null,null,null,null,null,null,null,null,null,null,null,null,null,null,null,null,null,null,null,null,null,null,null,null,null,null,null,null,null,null,null,null,null,null,null,null,null,null,null,null,null,null,null,null,null,null,null,null,null,null,null,null,163,null,null,null,null,null,163]
[null,null,161,"06636009","Neu-Eichenberg",null,null,null,null,null,null,"Spangenberg",null,null,null,null,null,null,null,null,null,null,null,null,null,null,null,null,null,null,null,null,null,null,null,null,null,null,null,null,null,null,null,null,null,null,null,null,null,null,null,null,null,null,null,null,null,null,null,null,null,null,null,null,null,null,null,null,null,null,null,null,null,null,null,null,null,null,null,null,null,null,null,null,null,null,null,null,null,null,null,null,null,null,null,null,null,null,null,null,null,null,null,null,null,null,null,null,null,null,null,null,null,null,null,null,null,null,null,null,null,null,null,null,null,null,null,null,null,null,null,null,null,null,null,125,null,null,null,null,null,null,null,null,null,null,null,null,null,null,null,null,null,null,null,null,null,null,null,null,null,null,null,null,null,null,null,null,null,null,null,null,null,null,null,null,null,null,null,125]
[null,null,162,"06636010","Ringgau",null,null,null,null,null,null,"Staufenberg",null,null,null,null,null,null,null,null,null,null,null,null,null,null,null,null,null,null,null,null,null,null,null,null,null,null,null,null,null,null,null,null,null,35,null,null,null,null,null,null,null,null,null,null,null,null,null,null,null,null,null,null,null,null,null,null,null,null,null,null,null,null,null,null,null,null,null,null,null,null,null,null,null,null,null,null,null,null,null,null,null,null,null,null,null,null,null,null,null,null,null,null,null,null,null,null,null,null,null,null,null,null,null,null,null,null,null,null,null,null,null,null,null,null,null,null,null,null,null,null,null,null,null,null,null,null,null,null,null,null,null,null,null,null,null,null,null,null,null,null,null,null,null,null,null,null,null,null,null,null,null,null,null,null,null,null,null,null,null,null,null,null,null,null,null,null,null,35]
[null,null,163,"06636011","Sontra",null,null,null,null,null,null,"Tann (Rhön)",null,null,null,null,null,null,null,null,null,null,null,null,null,null,null,null,null,null,null,null,null,null,null,null,null,null,null,null,null,null,null,null,null,null,null,null,null,null,null,null,null,null,null,null,null,null,null,null,null,null,null,null,null,null,null,null,null,null,null,null,null,null,null,null,null,null,null,null,null,null,null,null,null,null,null,null,null,null,null,null,null,null,null,null,null,null,null,null,null,null,null,null,null,null,null,null,null,null,100,null,null,null,null,null,null,null,null,null,null,null,null,null,null,null,null,null,null,null,null,null,null,null,null,null,null,null,null,null,null,null,null,null,null,null,null,null,null,null,null,null,null,null,null,null,null,null,null,null,null,null,null,null,null,null,null,null,null,null,null,null,null,null,null,null,null,null,null,100]
[null,null,164,"06636012","Waldkappel",null,null,null,null,null,null,"Twistetal",null,null,null,null,null,null,null,null,null,null,null,null,null,null,null,null,null,null,null,null,null,null,null,null,null,null,null,null,null,null,null,null,null,null,null,null,null,null,null,null,null,null,null,null,null,null,null,null,null,null,null,null,null,null,null,null,null,null,null,null,null,null,null,null,null,null,null,null,null,null,null,null,null,null,null,null,null,null,null,null,null,null,null,null,null,null,null,null,null,null,null,null,null,null,null,null,null,null,null,null,null,null,null,null,null,null,null,null,null,null,null,null,null,null,null,null,null,null,null,null,null,null,null,null,null,null,null,null,null,null,null,null,null,null,null,null,null,null,null,null,null,null,null,null,null,147,null,null,null,null,null,null,null,null,null,null,null,null,null,null,null,null,null,null,null,null,null,147]
[null,null,165,"06636013","Wanfried",null,null,null,null,null,null,"Ulrichstein",null,null,null,null,null,null,null,null,null,null,null,null,null,null,null,null,null,null,null,null,null,null,null,null,null,null,null,null,null,null,null,null,null,null,null,null,null,null,null,null,null,null,null,null,null,null,null,null,null,null,null,null,null,null,null,null,null,null,null,null,null,null,null,null,null,null,null,null,null,null,null,null,null,75,null,null,null,null,null,null,null,null,null,null,null,null,null,null,null,null,null,null,null,null,null,null,null,null,null,null,null,null,null,null,null,null,null,null,null,null,null,null,null,null,null,null,null,null,null,null,null,null,null,null,null,null,null,null,null,null,null,null,null,null,null,null,null,null,null,null,null,null,null,null,null,null,null,null,null,null,null,null,null,null,null,null,null,null,null,null,null,null,null,null,null,null,null,75]
[null,null,166,"06636014","Wehretal",null,null,null,null,null,null,"Villmar",null,null,null,null,null,null,null,null,null,null,null,null,null,null,null,null,null,null,null,null,null,null,null,null,null,null,null,null,null,null,null,null,null,null,null,null,null,null,null,null,null,null,null,null,null,null,null,null,null,null,52,null,null,null,null,null,null,null,null,null,null,null,null,null,null,null,null,null,null,null,null,null,null,null,null,null,null,null,null,null,null,null,null,null,null,null,null,null,null,null,null,null,null,null,null,null,null,null,null,null,null,null,null,null,null,null,null,null,null,null,null,null,null,null,null,null,null,null,null,null,null,null,null,null,null,null,null,null,null,null,null,null,null,null,null,null,null,null,null,null,null,null,null,null,null,null,null,null,null,null,null,null,null,null,null,null,null,null,null,null,null,null,null,null,null,null,null,52]
[null,null,167,"06636015","Weißenborn",null,null,null,null,null,null,"Vöhl",null,null,null,null,null,null,null,null,null,null,null,null,null,null,null,null,null,null,null,null,null,null,null,null,null,null,null,null,null,null,null,null,null,null,null,null,null,null,null,null,null,null,null,null,null,null,null,null,null,null,null,null,null,null,null,null,null,null,null,null,null,null,null,null,null,null,null,null,null,null,null,null,null,null,null,null,null,null,null,null,null,null,null,null,null,null,null,null,null,null,null,null,null,null,null,null,null,null,null,null,null,null,null,null,null,null,null,null,null,null,null,null,null,null,null,null,null,null,null,null,null,null,null,null,null,null,null,null,null,null,null,null,null,null,null,null,null,null,null,null,null,null,null,null,null,null,148,null,null,null,null,null,null,null,null,null,null,null,null,null,null,null,null,null,null,null,null,148]
[null,null,168,"06636016","Witzenhausen",null,null,null,null,null,null,"Volkmarsen",null,null,null,null,null,null,null,null,null,null,null,null,null,null,null,null,null,null,null,null,null,null,null,null,null,null,null,null,null,null,null,null,null,null,null,null,null,null,null,null,null,null,null,null,null,null,null,null,null,null,null,null,null,null,null,null,null,null,null,null,null,null,null,null,null,null,null,null,null,null,null,null,null,null,null,null,null,null,null,null,null,null,null,null,null,null,null,null,null,null,null,null,null,null,null,null,null,null,null,null,null,null,null,null,null,null,null,null,null,null,null,null,null,null,null,null,null,null,null,null,null,null,null,null,null,null,null,null,null,null,null,null,null,null,null,null,null,null,null,null,null,null,null,null,null,null,null,149,null,null,null,null,null,null,null,null,null,null,null,null,null,null,null,null,null,null,null,149]
[null,null,null,null,null,null,null,null,null,null,null,"Wabern",null,null,null,null,null,null,null,null,null,null,null,null,null,null,null,null,null,null,null,null,null,null,null,null,null,null,null,null,null,null,null,null,null,null,null,null,null,null,null,null,null,null,null,null,null,null,null,null,null,null,null,null,null,null,null,null,null,null,null,null,null,null,null,null,null,null,null,null,null,null,null,null,null,null,null,null,null,null,null,null,null,null,null,null,null,null,null,null,null,null,null,null,null,null,null,null,null,null,null,null,null,null,null,null,null,null,null,null,null,null,null,null,null,null,null,null,null,null,null,null,null,null,null,null,126,null,null,null,null,null,null,null,null,null,null,null,null,null,null,null,null,null,null,null,null,null,null,null,null,null,null,null,null,null,null,null,null,null,null,null,null,null,null,null,null,null,null,126]
[null,null,null,null,null,null,null,null,null,null,null,"Waldbrunn (Westerwald)",null,null,null,null,null,null,null,null,null,null,null,null,null,null,null,null,null,null,null,null,null,null,null,null,null,null,null,null,null,null,null,null,null,null,null,null,null,null,null,null,null,null,null,null,null,null,null,null,null,null,null,53,null,null,null,null,null,null,null,null,null,null,null,null,null,null,null,null,null,null,null,null,null,null,null,null,null,null,null,null,null,null,null,null,null,null,null,null,null,null,null,null,null,null,null,null,null,null,null,null,null,null,null,null,null,null,null,null,null,null,null,null,null,null,null,null,null,null,null,null,null,null,null,null,null,null,null,null,null,null,null,null,null,null,null,null,null,null,null,null,null,null,null,null,null,null,null,null,null,null,null,null,null,null,null,null,null,null,null,null,null,null,null,null,null,null,null,53]
[null,null,null,null,null,null,null,null,null,null,null,"Waldeck",null,null,null,null,null,null,null,null,null,null,null,null,null,null,null,null,null,null,null,null,null,null,null,null,null,null,null,null,null,null,null,null,null,null,null,null,null,null,null,null,null,null,null,null,null,null,null,null,null,null,null,null,null,null,null,null,null,null,null,null,null,null,null,null,null,null,null,null,null,null,null,null,null,null,null,null,null,null,null,null,null,null,null,null,null,null,null,null,null,null,null,null,null,null,null,null,null,null,null,null,null,null,null,null,null,null,null,null,null,null,null,null,null,null,null,null,null,null,null,null,null,null,null,null,null,null,null,null,null,null,null,null,null,null,null,null,null,null,null,null,null,null,null,null,null,null,null,null,150,null,null,null,null,null,null,null,null,null,null,null,null,null,null,null,null,null,null,150]
[null,null,null,null,null,null,null,null,null,null,null,"Waldkappel",null,null,null,null,null,null,null,null,null,null,null,null,null,null,null,null,null,null,null,null,null,null,null,null,null,null,null,null,null,null,null,null,null,null,null,null,null,null,null,null,null,null,null,null,null,null,null,null,null,null,null,null,null,null,null,null,null,null,null,null,null,null,null,null,null,null,null,null,null,null,null,null,null,null,null,null,null,null,null,null,null,null,null,null,null,null,null,null,null,null,null,null,null,null,null,null,null,null,null,null,null,null,null,null,null,null,null,null,null,null,null,null,null,null,null,null,null,null,null,null,null,null,null,null,null,null,null,null,null,null,null,null,null,null,null,null,null,null,null,null,null,null,null,null,null,null,null,null,null,null,null,null,null,null,null,null,null,null,null,null,null,null,164,null,null,null,null,164]
[null,null,null,null,null,null,null,null,null,null,null,"Wanfried",null,null,null,null,null,null,null,null,null,null,null,null,null,null,null,null,null,null,null,null,null,null,null,null,null,null,null,null,null,null,null,null,null,null,null,null,null,null,null,null,null,null,null,null,null,null,null,null,null,null,null,null,null,null,null,null,null,null,null,null,null,null,null,null,null,null,null,null,null,null,null,null,null,null,null,null,null,null,null,null,null,null,null,null,null,null,null,null,null,null,null,null,null,null,null,null,null,null,null,null,null,null,null,null,null,null,null,null,null,null,null,null,null,null,null,null,null,null,null,null,null,null,null,null,null,null,null,null,null,null,null,null,null,null,null,null,null,null,null,null,null,null,null,null,null,null,null,null,null,null,null,null,null,null,null,null,null,null,null,null,null,null,null,165,null,null,null,165]
[null,null,null,null,null,null,null,null,null,null,null,"Wartenberg",null,null,null,null,null,null,null,null,null,null,null,null,null,null,null,null,null,null,null,null,null,null,null,null,null,null,null,null,null,null,null,null,null,null,null,null,null,null,null,null,null,null,null,null,null,null,null,null,null,null,null,null,null,null,null,null,null,null,null,null,null,null,null,null,null,null,null,null,null,null,null,null,null,null,76,null,null,null,null,null,null,null,null,null,null,null,null,null,null,null,null,null,null,null,null,null,null,null,null,null,null,null,null,null,null,null,null,null,null,null,null,null,null,null,null,null,null,null,null,null,null,null,null,null,null,null,null,null,null,null,null,null,null,null,null,null,null,null,null,null,null,null,null,null,null,null,null,null,null,null,null,null,null,null,null,null,null,null,null,null,null,null,null,null,null,null,null,76]
[null,null,null,null,null,null,null,null,null,null,null,"Wehretal",null,null,null,null,null,null,null,null,null,null,null,null,null,null,null,null,null,null,null,null,null,null,null,null,null,null,null,null,null,null,null,null,null,null,null,null,null,null,null,null,null,null,null,null,null,null,null,null,null,null,null,null,null,null,null,null,null,null,null,null,null,null,null,null,null,null,null,null,null,null,null,null,null,null,null,null,null,null,null,null,null,null,null,null,null,null,null,null,null,null,null,null,null,null,null,null,null,null,null,null,null,null,null,null,null,null,null,null,null,null,null,null,null,null,null,null,null,null,null,null,null,null,null,null,null,null,null,null,null,null,null,null,null,null,null,null,null,null,null,null,null,null,null,null,null,null,null,null,null,null,null,null,null,null,null,null,null,null,null,null,null,null,null,null,166,null,null,166]
[null,null,null,null,null,null,null,null,null,null,null,"Weilburg",null,null,null,null,null,null,null,null,null,null,null,null,null,null,null,null,null,null,null,null,null,null,null,null,null,null,null,null,null,null,null,null,null,null,null,null,null,null,null,null,null,null,null,null,null,null,null,null,null,null,null,null,54,null,null,null,null,null,null,null,null,null,null,null,null,null,null,null,null,null,null,null,null,null,null,null,null,null,null,null,null,null,null,null,null,null,null,null,null,null,null,null,null,null,null,null,null,null,null,null,null,null,null,null,null,null,null,null,null,null,null,null,null,null,null,null,null,null,null,null,null,null,null,null,null,null,null,null,null,null,null,null,null,null,null,null,null,null,null,null,null,null,null,null,null,null,null,null,null,null,null,null,null,null,null,null,null,null,null,null,null,null,null,null,null,null,null,54]
[null,null,null,null,null,null,null,null,null,null,null,"Weilmünster",null,null,null,null,null,null,null,null,null,null,null,null,null,null,null,null,null,null,null,null,null,null,null,null,null,null,null,null,null,null,null,null,null,null,null,null,null,null,null,null,null,null,null,null,null,null,null,null,null,null,null,null,null,55,null,null,null,null,null,null,null,null,null,null,null,null,null,null,null,null,null,null,null,null,null,null,null,null,null,null,null,null,null,null,null,null,null,null,null,null,null,null,null,null,null,null,null,null,null,null,null,null,null,null,null,null,null,null,null,null,null,null,null,null,null,null,null,null,null,null,null,null,null,null,null,null,null,null,null,null,null,null,null,null,null,null,null,null,null,null,null,null,null,null,null,null,null,null,null,null,null,null,null,null,null,null,null,null,null,null,null,null,null,null,null,null,null,55]
[null,null,null,null,null,null,null,null,null,null,null,"Weinbach",null,null,null,null,null,null,null,null,null,null,null,null,null,null,null,null,null,null,null,null,null,null,null,null,null,null,null,null,null,null,null,null,null,null,null,null,null,null,null,null,null,null,null,null,null,null,null,null,null,null,null,null,null,null,56,null,null,null,null,null,null,null,null,null,null,null,null,null,null,null,null,null,null,null,null,null,null,null,null,null,null,null,null,null,null,null,null,null,null,null,null,null,null,null,null,null,null,null,null,null,null,null,null,null,null,null,null,null,null,null,null,null,null,null,null,null,null,null,null,null,null,null,null,null,null,null,null,null,null,null,null,null,null,null,null,null,null,null,null,null,null,null,null,null,null,null,null,null,null,null,null,null,null,null,null,null,null,null,null,null,null,null,null,null,null,null,null,56]
[null,null,null,null,null,null,null,null,null,null,null,"Weißenborn",null,null,null,null,null,null,null,null,null,null,null,null,null,null,null,null,null,null,null,null,null,null,null,null,null,null,null,null,null,null,null,null,null,null,null,null,null,null,null,null,null,null,null,null,null,null,null,null,null,null,null,null,null,null,null,null,null,null,null,null,null,null,null,null,null,null,null,null,null,null,null,null,null,null,null,null,null,null,null,null,null,null,null,null,null,null,null,null,null,null,null,null,null,null,null,null,null,null,null,null,null,null,null,null,null,null,null,null,null,null,null,null,null,null,null,null,null,null,null,null,null,null,null,null,null,null,null,null,null,null,null,null,null,null,null,null,null,null,null,null,null,null,null,null,null,null,null,null,null,null,null,null,null,null,null,null,null,null,null,null,null,null,null,null,null,167,null,167]
[null,null,null,null,null,null,null,null,null,null,null,"Wettenberg",null,null,null,null,null,null,null,null,null,null,null,null,null,null,null,null,null,null,null,null,null,null,null,null,null,null,null,null,null,null,null,null,null,null,36,null,null,null,null,null,null,null,null,null,null,null,null,null,null,null,null,null,null,null,null,null,null,null,null,null,null,null,null,null,null,null,null,null,null,null,null,null,null,null,null,null,null,null,null,null,null,null,null,null,null,null,null,null,null,null,null,null,null,null,null,null,null,null,null,null,null,null,null,null,null,null,null,null,null,null,null,null,null,null,null,null,null,null,null,null,null,null,null,null,null,null,null,null,null,null,null,null,null,null,null,null,null,null,null,null,null,null,null,null,null,null,null,null,null,null,null,null,null,null,null,null,null,null,null,null,null,null,null,null,null,null,null,36]
[null,null,null,null,null,null,null,null,null,null,null,"Willingen (Upland)",null,null,null,null,null,null,null,null,null,null,null,null,null,null,null,null,null,null,null,null,null,null,null,null,null,null,null,null,null,null,null,null,null,null,null,null,null,null,null,null,null,null,null,null,null,null,null,null,null,null,null,null,null,null,null,null,null,null,null,null,null,null,null,null,null,null,null,null,null,null,null,null,null,null,null,null,null,null,null,null,null,null,null,null,null,null,null,null,null,null,null,null,null,null,null,null,null,null,null,null,null,null,null,null,null,null,null,null,null,null,null,null,null,null,null,null,null,null,null,null,null,null,null,null,null,null,null,null,null,null,null,null,null,null,null,null,null,null,null,null,null,null,null,null,null,null,null,null,null,151,null,null,null,null,null,null,null,null,null,null,null,null,null,null,null,null,null,151]
[null,null,null,null,null,null,null,null,null,null,null,"Willingshausen",null,null,null,null,null,null,null,null,null,null,null,null,null,null,null,null,null,null,null,null,null,null,null,null,null,null,null,null,null,null,null,null,null,null,null,null,null,null,null,null,null,null,null,null,null,null,null,null,null,null,null,null,null,null,null,null,null,null,null,null,null,null,null,null,null,null,null,null,null,null,null,null,null,null,null,null,null,null,null,null,null,null,null,null,null,null,null,null,null,null,null,null,null,null,null,null,null,null,null,null,null,null,null,null,null,null,null,null,null,null,null,null,null,null,null,null,null,null,null,null,null,null,null,null,null,127,null,null,null,null,null,null,null,null,null,null,null,null,null,null,null,null,null,null,null,null,null,null,null,null,null,null,null,null,null,null,null,null,null,null,null,null,null,null,null,null,null,127]
[null,null,null,null,null,null,null,null,null,null,null,"Witzenhausen",null,null,null,null,null,null,null,null,null,null,null,null,null,null,null,null,null,null,null,null,null,null,null,null,null,null,null,null,null,null,null,null,null,null,null,null,null,null,null,null,null,null,null,null,null,null,null,null,null,null,null,null,null,null,null,null,null,null,null,null,null,null,null,null,null,null,null,null,null,null,null,null,null,null,null,null,null,null,null,null,null,null,null,null,null,null,null,null,null,null,null,null,null,null,null,null,null,null,null,null,null,null,null,null,null,null,null,null,null,null,null,null,null,null,null,null,null,null,null,null,null,null,null,null,null,null,null,null,null,null,null,null,null,null,null,null,null,null,null,null,null,null,null,null,null,null,null,null,null,null,null,null,null,null,null,null,null,null,null,null,null,null,null,null,null,null,168,168]
[null,null,null,null,null,null,null,null,null,null,null,"Gesamtergebnis",2,3,4,5,6,7,8,9,10,11,12,13,14,15,16,17,18,19,20,21,22,23,24,25,26,27,28,29,30,31,32,33,34,35,36,37,38,39,40,41,42,43,44,45,46,47,48,49,50,51,52,53,54,55,56,57,58,59,60,61,62,63,64,65,66,67,68,69,70,71,72,73,74,75,76,77,78,79,80,81,82,83,84,85,86,87,88,89,90,91,92,93,94,95,96,97,98,99,100,101,102,103,104,105,106,107,108,109,110,111,112,113,114,115,116,117,118,119,120,121,122,123,124,125,126,127,128,129,130,131,132,133,134,135,136,137,138,139,140,141,142,143,144,145,146,147,148,149,150,151,152,153,154,155,156,157,158,159,160,161,162,163,164,165,166,167,168,14195]

{"sheet":"Tabelle2","index":13,"n_rows":18,"n_cols":10,"rows_kept":18,"cut":false,"hidden":true,"merged":[]}
[]
[]
[]
[]
[]
[]
[]
[]
[]
[]
[]
[]
[]
[]
[]
[]
[null,null,null,null,null,null,null,null,null,1]
[null,null,null,null,null,null,null,null,null,2]