{"text_format":"1","workbook":"xlsx","n_sheets":14,"sheets":["Hinweise","Formular Bundesprogramm","EXCEL-Tabelle per Mail roh","EXCEL-Tabelle per Mail","Werteliste IDENT_LAND","Werteliste ID_FOERDB","Werteliste Gemeindeschlüssel","Werteliste Schulform","antragsberechtigt B","Adressen","Einstellungen","Tabelle1","LK mit Kommunen","Tabelle2"],"not_rendered":{"charts":0,"images":5,"macros":1,"external_links":0,"defined_names":8,"comments":2,"pivot_tables":2},"unopened":[],"bounds":{"document_bytes":16777216,"sheet_cells":100000,"rows_first":2000,"rows_last":500,"rows_between":2000,"halvings":0,"cell_chars":16384,"cell_head_chars":4096},"cells_cut":0,"cells_raw":0,"read":"whole","date_system":"1900"}

{"sheet":"Hinweise","index":0,"n_rows":38,"n_cols":5,"rows_kept":38,"cut":false,"hidden":false,"merged":[]}
[null,"Anmeldeformular für Investitionsmaßnahmen im Rahmen des Kommunalinvestitionsförderungsgesetz (KInvFG) des Bundes"]
[]
[]
[]
[]
[]
[]
[]
[]
[]
{"$rows_left_out":29}
{"sheet":"Formular Bundesprogramm","index":1,"n_rows":148,"n_cols":18,"rows_kept":148,"cut":false,"hidden":false,"merged":[[1,0,1,2],[2,0,2,2],[3,0,3,2],[19,1,19,3],[5,1,5,3],[8,1,8,3],[10,1,10,3],[12,1,12,3],[14,1,14,3],[21,1,21,3],[32,1,32,2],[73,0,73,2],[30,1,30,2],[35,2,35,3],[26,1,26,3],[40,2,40,3],[67,2,67,3],[28,1,28,3],[74,0,74,2],[106,0,106,1],[94,1,96,2],[90,0,90,2],[75,0,75,2],[126,1,126,2],[127,1,127,2],[130,1,131,1],[91,0,91,2],[92,0,92,2],[130,0,132,0],[128,1,128,2],[125,1,125,2],[115,1,116,2],[115,0,116,0],[124,1,124,2],[113,2,113,3],[108,2,108,3]]}
[null,"Änderungsantrag ",null,{"$f":"IF($B$17=\"Bitte auswählen!\",\"\",CONCATENATE(\"IDENT \",$B$40,\"B\",$D$5))","v":""},null,null,null,null,false,"Kontrollkästchen Änderungsantrag"]
[null,null,null,{"$f":"IF($I$2=1,D1,\"\")","v":""},null,null,null,null,{"$f":"IF(I1=TRUE,1,0)","v":0},"Kontrollkästchen Änderungsantrag"]
[null,null,null,{"$f":"IF($B$17=\"Bitte auswählen!\",\"\",CONCATENATE($B$40,\"B\",$D$5))","v":""}]
[null,null,null,{"$f":"NOW()","v":"2022-01-21T12:31:36.800"}]
[null,null,null,{"$f":"IF($D$4=\"\",\"----------\",(ROUND((D4*100000),0)))","v":4458252195}]
[null,"Anmeldung von Investitionsmaßnahmen i.R.d. \nKommunalinvestitionsförderungsgesetzes des Bundes"]
[]
["Ansprechpartner"]
["Name"]
[]
{"$rows_left_out":139}
{"sheet":"EXCEL-Tabelle per Mail roh","index":2,"n_rows":28,"n_cols":70,"rows_kept":28,"cut":false,"hidden":true,"merged":[[4,56,4,56]]}
["IDENT_LAND","L_ANSPRECHPARTNER_NAME","L_ANSPRECHPARTNER_VORNAME","L_ANSPRECHPARTNER_TELEFON","L_ANSPRECHPARTNER_E_MAIL","ANMELDENDER","GKZ","LANDKREIS","TRÄGER","BESCHREIBUNG","BEZ_MASSNAME","BELEGENHEIT_STRASSE","BELEGENHEIT_HAUSNR","BELEGENHEIT_PLZ","BELEGENHEIT_ORT","BELEGENHEIT_GKZ","BELEGENHEIT_GEMEINDE","ANZAHL","FOERDMITTEL_BEANTR","ANTEIL_90_80","ANTEIL_10_20","EIGENMITTEL","DRITTMITTEL","SUMME_INVEST_VOL","GESAMTKOSTEN","OEPP","FOERDMITTEL_ABRUF_2016","FOERDMITTEL_ABRUF_2017","FOERDMITTEL_ABRUF_2018","FOERDMITTEL_ABRUF_2019","FOERDMITTEL_ABRUF_2020","FOERDMITTEL_ABRUF_2021","FOERDMITTEL_ABRUF_2022","FOERDMITTEL_ABRUF_2023","FOERDMITTEL_ABRUF_SUM","L_AUFTEILUNG_VOST","CHK_GESAMTFINANZIERUNG","CHK_NACHHALTIGKEIT","CHK_DOPPELFOERDERUNG","MASSNAHMENBEGINN","VORAUS_ENDABNAHME","L_EINHALTUNG_RL","BEMERKUNG","DAT_ABGABE","BERUECK_AND_FOERPROG","NAME_AND_FOERPROG","BEANTR_AND_FOERDPROG","BEMERK_AND_FOERDPROG","WIBank_Zustimmung","WIBank_Prüfer","WIBank_Prüfer_Telefon","WIBank_Datum_Zustimmung","WiBank_Prüfbemerkung","HMDF_SICHTVERMERK","HMDF_PRUEFER","HMDF_PRUEFER_TEL","HMDF_SICHTVERMERK_DAT","HMDF_SICHTVERMERK_BEM","KOMMUNALES_INVVOL","PRUEFVERMERK","FOERDMITTEL_BEANTRAGT","FB","VH_VN"]
[{"$f":"A3","v":""},{"$f":"IF(B3 <> \"Eingabe\", B3, \"\")","v":0},{"$f":"IF(C3 <> \"Eingabe\", C3, \"\")","v":0},{"$f":"IF(D3 <> \"Eingabe\", D3, \"\")","v":0},{"$f":"IF(E3 <> \"Eingabe\", E3, \"\")","v":0},{"$f":"IF(F3<>\"bitte auswählen\", F3, \"\")","v":"Bitte auswählen!"},{"$f":"IF(G3<>\"Gemeindeschlüssel\", G3, \"\")","v":" "},{"$f":"IF(LEN(TRIM(H3))>0,H3,\"\")","v":""},{"$f":"I3","v":0},{"$f":"J3","v":""},{"$f":"IF(ISBLANK(K3),\"\",K3)","v":""},{"$f":"L3","v":0},{"$f":"M3","v":0},{"$f":"N3","v":0},{"$f":"O3","v":0},{"$f":"P3","v":""},{"$f":"IF(Q3<>0, Q3, \"\")","v":""},{"$f":"R3","v":0},{"$f":"INT(100*S3)/100","v":0},{"$f":"INT(100*T3)/100","v":0},{"$f":"INT(100*U3+0.5)/100","v":0},0,0,0,0,0,{"$f":"AA3","v":0},0,0,{"$f":"AD3","v":0},{"$f":"AE3","v":0},{"$f":"AF3","v":0},{"$f":"AG3","v":0},{"$f":"AH3","v":0},0,0,0,0,0,{"$f":"IF(LEFT(AN3, 7)<>\"Eingabe\",AN3,\"\")","v":"00:00:00"},{"$f":"IF(LEFT(AO3, 7)<>\"Eingabe\",AO3,\"\")","v":"00:00:00"},{"$f":"AP3","v":0},{"$f":"IF(LEN(TRIM(AQ3))>0,AQ3,\"\")","v":""},{"$f":"IF(LEFT(AR3, 7)<>\"Versand\",AR3,\"\")","v":"2022-01-21T12:31:36.800"},{"$f":"AS3","v":0},{"$f":"AT3","v":""},{"$f":"AU3","v":""},{"$f":"AV3","v":""},{"$f":"IF(ISBLANK(AW3),\"\",AW3)","v":""},{"$f":"IF(ISBLANK(AX3),\"\",AX3)","v":""},{"$f":"IF(ISBLANK(AY3),\"\",AY3)","v":""},{"$f":"IF(ISBLANK(AZ3),\"\",AZ3)","v":""},{"$f":"IF(ISBLANK(BA3),\"\",BA3)","v":""},null,null,null,null,null,{"$f":"BG3","v":0},null,null,{"$f":"BJ3","v":0},"VH"]
[{"$f":"'Formular Bundesprogramm'!D3","v":""},{"$f":"'Formular Bundesprogramm'!B9","v":0},{"$f":"'Formular Bundesprogramm'!B11","v":0},{"$f":"'Formular Bundesprogramm'!B13","v":0},{"$f":"'Formular Bundesprogramm'!B15","v":0},{"$f":"'Formular Bundesprogramm'!B17","v":"Bitte auswählen!"},{"$f":"'Formular Bundesprogramm'!D$17","v":" "},{"$f":"IF(LEN(TRIM('Formular Bundesprogramm'!B20))>0,'Formular Bundesprogramm'!B20,\"\")","v":""},{"$f":"'Formular Bundesprogramm'!B22","v":0},{"$f":"IF('Formular Bundesprogramm'!B27=\"Keine Auswahl getroffen!\",\"\",'Formular Bundesprogramm'!B27)","v":""},{"$f":"IF(LEN(TRIM('Formular Bundesprogramm'!B31))>0,'Formular Bundesprogramm'!B31,\"\")","v":""},{"$f":"'Formular Bundesprogramm'!B33","v":0},{"$f":"'Formular Bundesprogramm'!D33","v":0},{"$f":"'Formular Bundesprogramm'!B36","v":0},{"$f":"'Formular Bundesprogramm'!C36","v":0},{"$f":"'Formular Bundesprogramm'!C39","v":""},{"$f":"'Formular Bundesprogramm'!B39","v":0},{"$f":"'Formular Bundesprogramm'!B41","v":0},{"$f":"'Formular Bundesprogramm'!B47","v":0},{"$f":"'Formular Bundesprogramm'!B49","v":0},{"$f":"'Formular Bundesprogramm'!B51","v":0},{"$f":"'Formular Bundesprogramm'!B53","v":0},{"$f":"'Formular Bundesprogramm'!B55","v":0},{"$f":"'Formular Bundesprogramm'!B57","v":0},{"$f":"'Formular Bundesprogramm'!D55","v":0},{"$f":"'Formular Bundesprogramm'!I47","v":0},0,0,0,0,0,0,{"$f":"'Formular Bundesprogramm'!B64","v":0},{"$f":"'Formular Bundesprogramm'!B66","v":0},{"$f":"'Formular Bundesprogramm'!B68","v":0},{"$f":"'Formular Bundesprogramm'!I76","v":0},{"$f":"'Formular Bundesprogramm'!I82","v":0},{"$f":"'Formular Bundesprogramm'!I84","v":0},{"$f":"'Formular Bundesprogramm'!I86","v":0},{"$f":"'Formular Bundesprogramm'!D83","v":"00:00:00"},{"$f":"'Formular Bundesprogramm'!D85","v":"00:00:00"},{"$f":"'Formular Bundesprogramm'!I91","v":0},{"$f":"IF(LEN(TRIM('Formular Bundesprogramm'!B95))>0, 'Formular Bundesprogramm'!B95, \"\")","v":""},{"$f":"'Formular Bundesprogramm'!D4","v":"2022-01-21T12:31:36.800"},{"$f":"'Formular Bundesprogramm'!I110","v":0},{"$f":"IF(LEN(TRIM('Formular Bundesprogramm'!C109))>0,'Formular Bundesprogramm'!C109,\"\")","v":""},{"$f":"IF(LEN(TRIM('Formular Bundesprogramm'!C114))>0,'Formular Bundesprogramm'!C114,\"\")","v":""},{"$f":"IF(LEN(TRIM('Formular Bundesprogramm'!B116))>0,'Formular Bundesprogramm'!B116,\"\")","v":""},null,null,null,null,null,null,null,null,null,null,null,null,null,{"$f":"'Formular Bundesprogramm'!I30","v":0}]
[]
[null,null,null,null,null,null,null,null,null,null,null,null,null,null,null,null,null,null,null,null,null,null,null,null,null,null,null,null,null,null,null,null,null,null,null,null,null,null,null,null,null,null,null,null,null,null,null,"umbenannt","umbenannt","In E2 und E3 fest \"B\" reinschreiben, da hier nur Bundesprogramm","In E2 und E3 fest \"B\" reinschreiben, da hier nur Bundesprogramm","In E2 und E3 fest \"B\" reinschreiben, da hier nur Bundesprogramm","In E2 und E3 fest \"B\" reinschreiben, da hier nur Bundesprogramm","In E2 und E3 fest \"B\" reinschreiben, da hier nur Bundesprogramm"]
[]
[null,null,null,null,null,null,null,null,null,null,null,null,null,null,null,null,null,null,null,null,null,null,null,null,null,null,null,null,null,null,null,null,null,null,null,null,null,null,null,null,null,null,null,null,null,null,null,null,null,"#WENN(LÄNGE(GLÄTTEN(E3))>0;E3;\"\")","#WENN(LÄNGE(GLÄTTEN(E3))>0;E3;\"\")","#WENN(LÄNGE(GLÄTTEN(E3))>0;E3;\"\")","#WENN(LÄNGE(GLÄTTEN(E3))>0;E3;\"\")","#WENN(LÄNGE(GLÄTTEN(E3))>0;E3;\"\")"]
[null,null,null,null,null,null,null,null,null,null,null,null,null,null,null,null,null,null,null,null,null,null,null,null,null,null,null,null,null,null,null,null,null,null,null,null,null,null,null,null,null,null,null,null,null,null,null,null,null,"#WENN('Formular Bundesprogramm'!$B$17=\"Bitte auswählen!\";\" \";SVERWEIS('Formular Bundesprogramm'!$B$17;'Werteliste IDENT_LAND'!A1:F7980;4;FALSCH))","#WENN('Formular Bundesprogramm'!$B$17=\"Bitte auswählen!\";\" \";SVERWEIS('Formular Bundesprogramm'!$B$17;'Werteliste IDENT_LAND'!A1:F7980;4;FALSCH))","#WENN('Formular Bundesprogramm'!$B$17=\"Bitte auswählen!\";\" \";SVERWEIS('Formular Bundesprogramm'!$B$17;'Werteliste IDENT_LAND'!A1:F7980;4;FALSCH))","#WENN('Formular Bundesprogramm'!$B$17=\"Bitte auswählen!\";\" \";SVERWEIS('Formular Bundesprogramm'!$B$17;'Werteliste IDENT_LAND'!A1:F7980;4;FALSCH))","#WENN('Formular Bundesprogramm'!$B$17=\"Bitte auswählen!\";\" \";SVERWEIS('Formular Bundesprogramm'!$B$17;'Werteliste IDENT_LAND'!A1:F7980;4;FALSCH))"]
[]
[]
{"$rows_left_out":19}
{"sheet":"EXCEL-Tabelle per Mail","index":3,"n_rows":1,"n_cols":63,"rows_kept":1,"cut":false,"hidden":true,"merged":[]}
["IDENT_LAND","L_ANSPRECHPARTNER_NAME","L_ANSPRECHPARTNER_VORNAME","L_ANSPRECHPARTNER_TELEFON","L_ANSPRECHPARTNER_E_MAIL","ANMELDENDER","GKZ","LANDKREIS","TRÄGER","BESCHREIBUNG","BEZ_MASSNAME","BELEGENHEIT_STRASSE","BELEGENHEIT_HAUSNR","BELEGENHEIT_PLZ","BELEGENHEIT_ORT","BELEGENHEIT_GKZ","BELEGENHEIT_GEMEINDE","ANZAHL","FOERDMITTEL_BEANTR","ANTEIL_90_80","ANTEIL_10_20","EIGENMITTEL","DRITTMITTEL","SUMME_INVEST_VOL","GESAMTKOSTEN","OEPP","FOERDMITTEL_ABRUF_2016","FOERDMITTEL_ABRUF_2017","FOERDMITTEL_ABRUF_2018","FOERDMITTEL_ABRUF_2019","FOERDMITTEL_ABRUF_2020","FOERDMITTEL_ABRUF_2021","FOERDMITTEL_ABRUF_2022","FOERDMITTEL_ABRUF_2023","FOERDMITTEL_ABRUF_SUM","L_AUFTEILUNG_VOST","CHK_GESAMTFINANZIERUNG","CHK_NACHHALTIGKEIT","CHK_DOPPELFOERDERUNG","MASSNAHMENBEGINN","VORAUS_ENDABNAHME","L_EINHALTUNG_RL","BEMERKUNG","DAT_ABGABE","BERUECK_AND_FOERPROG","NAME_AND_FOERPROG","BEANTR_AND_FOERDPROG","BEMERK_AND_FOERDPROG","WIBank_Zustimmung","WIBank_Prüfer","WIBank_Prüfer_Telefon","WIBank_Datum_Zustimmung","WiBank_Prüfbemerkung","HMDF_SICHTVERMERK","HMDF_PRUEFER","HMDF_PRUEFER_TEL","HMDF_SICHTVERMERK_DAT","HMDF_SICHTVERMERK_BEM","KOMMUNALES_INVVOL","PRUEFVERMERK","FOERDMITTEL_BEANTRAGT","FB","VH_VN"]

{"sheet":"Werteliste IDENT_LAND","index":4,"n_rows":471,"n_cols":17,"rows_kept":471,"cut":false,"hidden":true,"merged":[]}
["Bitte auswählen!","Zuordnung zu Landkreis oder kreisfreie Stadt","GEMEINDESCHLUESSEL","PROGRAMM","ID_FOERDB",1,"Bitte auswählen!","GEMEINDESCHLUESSEL FÜR IDENT","Bitte auswählen!",1,null,1,"für GKZ Belegenheit",1,null,"-",1]
[null,null,null,null,null,2,"Bitte auswählen!",null,"Bitte auswählen!",null,null,2,null,2,"06411000","Darmstadt",3]
["Darmstadt","Kreisfreie Stadt","06411","B",null,3,"Darmstadt","06411000","Darmstadt",411000,{"$f":"VLOOKUP(J3,Adressen!$F$1:$L$469,7,FALSE)","v":64283},3,null,3,"06412000","Frankfurt am Main",4]
["Frankfurt am Main","Kreisfreie Stadt","06412","B",null,4,"Frankfurt am Main","06412000","Frankfurt am Main",412000,{"$f":"VLOOKUP(J4,Adressen!$F$1:$L$469,7,FALSE)","v":60311},4,null,4,"06413000","Offenbach am Main",5]
["Offenbach am Main","Kreisfreie Stadt","06413","B",null,5,"Offenbach am Main","06413000","Offenbach am Main",413000,{"$f":"VLOOKUP(J5,Adressen!$F$1:$L$469,7,FALSE)","v":63065},5,null,5,"06414000","Wiesbaden",6]
["Wiesbaden","Kreisfreie Stadt","06414","B",null,6,"Wiesbaden","06414000","Wiesbaden",414000,{"$f":"VLOOKUP(J6,Adressen!$F$1:$L$469,7,FALSE)","v":65183},6,null,6,"06431000","LK Bergstraße",8]
[null,null,null,"B",null,7,"Bitte auswählen!",null,"Bitte auswählen!","",null,7,null,7,"06431001","Abtsteinach",9]
["LK Bergstraße","LK Bergstraße","06431","B",null,8,"LK Bergstraße","06431000","LK Bergstraße",431000,{"$f":"VLOOKUP(J8,Adressen!$F$1:$L$469,7,FALSE)","v":64646},8,null,8,"06431002","Bensheim",10]
["Abtsteinach","LK Bergstraße","06431001","B",null,9,"Abtsteinach","06431001","Abtsteinach",431001,{"$f":"VLOOKUP(J9,Adressen!$F$1:$L$469,7,FALSE)","v":69518},9,null,9,"06431003","Biblis",11]
["Bensheim","LK Bergstraße","06431002","B",null,10,"Bensheim","06431002","Bensheim",431002,{"$f":"VLOOKUP(J10,Adressen!$F$1:$L$469,7,FALSE)","v":64625},10,null,10,"06431004","Birkenau",12]
{"$rows_left_out":462}
{"sheet":"Werteliste ID_FOERDB","index":5,"n_rows":20,"n_cols":15,"rows_kept":20,"cut":false,"hidden":true,"merged":[]}
["Werteliste Art der Maßnahme"]
[]
["Bitte auswählen!",1,"Keine Auswahl getroffen!","-"]
["1. a)  Krankenhäuser (Förderung in Hessen grds. über das Landesprogramm) ",2,"1. a)  Krankenhäuser ","-","1a"]
["1. b)  Lärmbekämpfung, insbesondere bei Straßen, ohne Schutz vor verhaltensbezogenem Lärm",3,"1. b)  Lärmbekämpfung, insbesondere bei Straßen, ohne Schutz vor verhaltensbezogenem Lärm","Die Umsetzung einer \"normalen Straßensanierung\" (ohne eine nachweisbare Lärmreduzierung über den Förderbereich nach § 3 S.1 Nr.1b KInvFG) ist nicht möglich.","1b"]
["1. c)  Städtebau (ohne Abwasser) einschließlich altersgerechter Umbau, Barriereabbau (auch im öffentlichen Personennahverkehr), Brachflächenrevitalisierung",4,"1. c)  Städtebau (ohne Abwasser) einschließlich altersgerechter Umbau, Barriereabbau , Brachflächenrevitalisierung","Der Barriereabbau wird auch im öffentlichen Personennahverkehr gefördert.\nRechtsgrundlage für die Förderung des Bundes ist das BauGB. ","1c"]
["1. d)  Informationstechnologie, beschränkt auf finanzschwache Kommunen in ländlichen Gebieten, zur Erreichung des 50 Mbit-Ausbauziels",5,"1. d)  Informationstechnologie, beschränkt auf finanzschwache Kommunen in ländlichen Gebieten, zur Erreichung des 50 Mbit-Ausbauziels","Die \"ländlichen Gebiete\" bestimmen sich nach den Zuordnungen des Landesentwicklungsplans.","1d"]
["1. e)  Energetische Sanierung sonstiger Infrastrukturinvestitionen",6,"1. e)  Energetische Sanierung sonstiger Infrastrukturinvestitionen","-","1e"]
["1. f)  Luftreinhaltung",7,"1. f)  Luftreinhaltung","-","1f"]
["2. a)  Einrichtungen der frühkindlichen Infrastruktur, einschließlich des Anschlusses dieser Infrastruktur an ein vorhandenes Netz, aus dem Wärme aus erneuerbaren Energieträgern bezogen wird",8,"2. a)  Einrichtungen der frühkindlichen Infrastruktur","Einschließlich des Anschlusses dieser Infrastruktur an ein vorhandenes Netz, aus dem Wärme aus erneuerbaren Energieträgern bezogen wird.\n\"frühkindlich\": betrifft Kinder bis zur Einschulung","2a"]
{"$rows_left_out":11}
{"sheet":"Werteliste Gemeindeschlüssel","index":6,"n_rows":471,"n_cols":5,"rows_kept":471,"cut":false,"hidden":true,"merged":[]}
["Werteliste Gemeindeschlüssel"]
[]
["bitte auswählen",1,"Gemeindeschlüssel","Kommune","Landkreis"]
[{"$f":"CONCATENATE(C4,\"           \",D4)","v":"06411           Darmstadt"},2,"06411","Darmstadt",""]
[{"$f":"CONCATENATE(C5,\"           \",D5)","v":"06412           Frankfurt am Main"},3,"06412","Frankfurt am Main",""]
[{"$f":"CONCATENATE(C6,\"           \",D6)","v":"06413           Offenbach am Main"},4,"06413","Offenbach am Main",""]
[{"$f":"CONCATENATE(C7,\"           \",D7)","v":"06414           Wiesbaden"},5,"06414","Wiesbaden",""]
[]
[{"$f":"CONCATENATE(C9,\"           \",D9)","v":"06431           LK Bergstraße"},6,"06431","LK Bergstraße","LK Bergstraße"]
[{"$f":"CONCATENATE(C10,\"     \",D10)","v":"06431001     Abtsteinach"},7,"06431001","Abtsteinach","LK Bergstraße"]
{"$rows_left_out":462}
{"sheet":"Werteliste Schulform","index":7,"n_rows":10,"n_cols":3,"rows_kept":10,"cut":false,"hidden":true,"merged":[]}
["Werteliste Schulform"]
[]
["bitte auswählen",1,"Keine Auswahl getroffen"]
["Grundschule",2,"Grundschule"]
["Haupt- oder Realschule",3,"Haupt- oder Realschule"]
["Gymnasium",4,"Gymnasium"]
["Gesamtschule",5,"Gesamtschule"]
["Berufsschule",6,"Berufsschule"]
["Förderschule",7,"Förderschule"]
["verschiedene Schulen",8,"verschiedene Schulen"]
{"$rows_left_out":1}
{"sheet":"antragsberechtigt B","index":8,"n_rows":274,"n_cols":26,"rows_kept":274,"cut":false,"hidden":true,"merged":[]}
["Bitte auswählen!",null,null,1,"Bitte auswählen!"]
["Ahnatal                       ","LK Kassel","06633001",2,"AHNATAL                       ",6633001,"ov",633,null,431000,{"$f":"(LEFT(J2,3))*1","v":431},null,"LK Bergstraße",null,1,633001,"ov","633","AHNATAL                       ",{"$f":"EXACT(A2,S2)","v":false},null,6633001,{"$f":"VLOOKUP(C2,'Werteliste IDENT_LAND'!$C$1:$G$505,5,FALSE)","v":"Ahnatal"},"AHNATAL                       ",{"$f":"PROPER(X2)","v":"Ahnatal                       "},"Ahnatal                       "]
["Alheim                        ","LK Hersfeld-Rotenburg","06632001",3,"ALHEIM                        ",6632001,"l",632,null,432000,432,null,"LK Darmstadt-Dieburg",null,null,632001,"l","632","ALHEIM                        ",{"$f":"EXACT(A3,S3)","v":false},null,6632001,null,"ALHEIM                        ",{"$f":"PROPER(X3)","v":"Alheim                        "},"Alheim                        "]
["Allendorf (Lumda)             ","LK Gießen","06531001",4,"ALLENDORF (LUMDA)             ",6531001,"l",531,null,436000,436,null,"LK Main-Taunus",null,null,531001,"l","531","ALLENDORF (LUMDA)             ",false,null,6531001,null,"ALLENDORF (LUMDA)             ","Allendorf (Lumda)             ","Allendorf (Lumda)             "]
["Alsfeld                       ","LK Vogelsberg","06535001",5,"ALSFELD                       ",6535001,"l",535,null,437000,437,null,"LK Odenwaldkreis",null,null,535001,"l","535","ALSFELD                       ",false,null,6535001,null,"ALSFELD                       ","Alsfeld                       ","Alsfeld                       "]
["Amoeneburg                    ","LK Marburg-Biedenkopf","06534001",6,"AMOENEBURG                    ",6534001,"l",534,null,438000,438,null,"LK Offenbach",null,null,534001,"l","534","AMOENEBURG                    ",false,null,6534001,null,"AMOENEBURG                    ","Amoeneburg                    ","Amoeneburg                    "]
["Angelburg                     ","LK Marburg-Biedenkopf","06534002",7,"ANGELBURG                     ",6534002,"l",534,null,439000,439,null,"LK Rheingau-Taunus",null,null,534002,"l","534","ANGELBURG                     ",false,null,6534002,null,"ANGELBURG                     ","Angelburg                     ","Angelburg                     "]
["Antrifttal                    ","LK Vogelsberg","06535002",8,"ANTRIFTTAL                    ",6535002,"l",535,null,440000,440,null,"LK Wetterau",null,null,535002,"l","535","ANTRIFTTAL                    ",false,null,6535002,null,"ANTRIFTTAL                    ","Antrifttal                    ","Antrifttal                    "]
["Bad Arolsen                   ","LK Waldeck-Frankenberg","06635002",9,"BAD AROLSEN                   ",6635002,"l",635,null,533000,533,null,"LK Limburg-Weilburg",null,null,635002,"l","635","BAD AROLSEN                   ",false,null,6635002,null,"BAD AROLSEN                   ","Bad Arolsen                   ","Bad Arolsen                   "]
["Bad Emstal                    ","LK Kassel","06633006",10,"BAD EMSTAL                    ",6633006,"o",633,null,535000,535,null,"LK Vogelsberg",null,null,633006,"o","633","BAD EMSTAL                    ",false,null,6633006,null,"BAD EMSTAL                    ","Bad Emstal                    ","Bad Emstal                    "]
{"$rows_left_out":265}
{"sheet":"Adressen","index":9,"n_rows":447,"n_cols":15,"rows_kept":447,"cut":false,"hidden":true,"merged":[]}
["GKZ","Kommunen",null,null,null,431000,"Landkreis Bergstraße","An den","Landrat","des Landkreises Bergstraße","Gräffstraße 5",64646,"Heppenheim",null,1]
[6633001,"AHNATAL",{"$f":"VLOOKUP(A2,'antragsberechtigt B'!$C$2:$F$400,3,FALSE)","v":{"$error":"#N/A"}},null,null,432000,"Landkreis Darmstadt-Dieburg","An den","Landrat","des Landkreises Darmstadt-Dieburg","Jägertorstr. 207",64289,"Darmstadt"]
[6632001,"ALHEIM",{"$f":"VLOOKUP(A3,'antragsberechtigt B'!$C$2:$F$400,3,FALSE)","v":{"$error":"#N/A"}},null,null,433000,"Landkreis Groß-Gerau","An den","Landrat","des Landkreises Groß-Gerau","Wilhelm-Seipp-Straße 4",64521,"Groß-Gerau"]
[6531001,"ALLENDORF (LUMDA), STADT",{"$f":"VLOOKUP(A4,'antragsberechtigt B'!$C$2:$F$400,3,FALSE)","v":{"$error":"#N/A"}},null,null,434000,"Hochtaunuskreis","An den","Landrat","des Hochtaunuskreises","Ludwig-Erhard-Anlage 1-4",61348,"Bad Homburg"]
[6535001,"ALSFELD, STADT",{"$f":"VLOOKUP(A5,'antragsberechtigt B'!$C$2:$F$400,3,FALSE)","v":{"$error":"#N/A"}},null,null,435000,"Main-Kinzig-Kreis","An den","Landrat","des Main-Kinzig-Kreises","Barbarossastraße 16-24",63569,"Gelnhausen"]
[6534001,"AMOENEBURG, STADT",{"$f":"VLOOKUP(A6,'antragsberechtigt B'!$C$2:$F$400,3,FALSE)","v":{"$error":"#N/A"}},null,null,436000,"Main-Taunus-Kreis","An den","Landrat","des Main-Taunus-Kreises","Am Kreishaus 1-5",65719,"Hofheim a. T."]
[6534002,"ANGELBURG",{"$f":"VLOOKUP(A7,'antragsberechtigt B'!$C$2:$F$400,3,FALSE)","v":{"$error":"#N/A"}},null,null,437000,"Odenwaldkreis","An den","Landrat","des Odenwaldkreises","Michelstädter Straße 12",64711,"Erbach"]
[6535002,"ANTRIFTTAL",{"$f":"VLOOKUP(A8,'antragsberechtigt B'!$C$2:$F$400,3,FALSE)","v":{"$error":"#N/A"}},null,null,438000,"Landkreis Offenbach","An den","Landrat","des Landkreises Offenbach","Werner-Hilpert-Straße 1",63128,"Dietzenbach"]
[6635002,"BAD AROLSEN, STADT",{"$f":"VLOOKUP(A9,'antragsberechtigt B'!$C$2:$F$400,3,FALSE)","v":{"$error":"#N/A"}},null,null,439000,"Rheingau-Taunus-Kreis","An den","Landrat","des Rheingau-Taunus-Kreises","Heimbacher Straße 7",65307,"Bad Schwalbach"]
[6633006,"BAD EMSTAL",{"$f":"VLOOKUP(A10,'antragsberechtigt B'!$C$2:$F$400,3,FALSE)","v":{"$error":"#N/A"}},null,null,440000,"Wetteraukreis","An den","Landrat","des Wetteraukreises","Europaplatz",61169,"Friedberg (Hessen)"]
{"$rows_left_out":438}
{"sheet":"Einstellungen","index":10,"n_rows":44,"n_cols":1,"rows_kept":44,"cut":false,"hidden":false,"merged":[]}
[]
["Arbeitshilfe Formular"]
[]
["Hohe Sicherheitseinstellungen können dazu führen, dass Dateien mit Makros nicht geöffnet oder bearbeitet werden können."]
["Sofern dies zu Problemen mit den Anmeldeformularen führt, kann die Speicherung der jeweiligen Datei als „xlsx-Datei“ erfolgen."]
[]
[]
[]
[]
[]
{"$rows_left_out":35}
{"sheet":"Tabelle1","index":11,"n_rows":18,"n_cols":1,"rows_kept":18,"cut":false,"hidden":true,"merged":[]}
["'Kommentare formatieren"]
[" Sub KommentareAnpassen()"]
[" Dim Kom As Comment"]
["    For Each Com In ActiveSheet.Comments"]
["        Kom.Shape.TextFrame.AutoSize = True"]
["        Next Kom"]
["       End Sub"]
[]
["'Kommentare an Textgröße anpassen"]
[" Sub KommentareFormatieren()"]
{"$rows_left_out":9}
{"sheet":"LK mit Kommunen","index":12,"n_rows":184,"n_cols":180,"rows_kept":184,"cut":false,"hidden":true,"merged":[]}
[null,null,1,"GKZ",null,null,null,null,null,null,null,"06437000","06531000"]
[6437000,"Odenwaldkreis",2,"06437000","LK Odenwald",null,6412000,"LANDKREIS FULDA"]
[6531000,"Kreis Gießen",3,"06437001","Bad König",null,6413000,"LANDKREIS WALDECK-FRANKENBERG"]
[6533000,"Kreis Limburg-Weilburg",4,"06437002","Beerfelden     ",null,6431000,"LANDKREIS LIMBURG-WEILBURG",null,null,null,"LK Odenwald"]
[6535000,"Vogelsbergkreis",5,"06437003","Brensbach",null,6431001,"LANDKREIS GIESSEN",null,null,null,"LK Gießen"]
[6631000,"Kreis Fulda",6,"06437004","Breuberg",null,6431003,"SCHWALM-EDER-KREIS",null,null,null,"Gesamtergebnis"]
[6634000,"Schwalm-Eder-Kreis",7,"06437005","Brombachtal",null,6431004,"ODENWALDKREIS"]
[6635000,"Kreis Waldeck-Frankenberg",8,"06437006","Erbach",null,6431010,"WERRA-MEISSNER-KREIS"]
[6636000,"Werra-Meißner-Kreis",9,"06437007","Fränkisch-Crumbach",null,6636009,"VOGELSBERGKREIS"]
[null,null,10,"06437008","Hesseneck"]
{"$rows_left_out":175}
{"sheet":"Tabelle2","index":13,"n_rows":18,"n_cols":10,"rows_kept":18,"cut":false,"hidden":true,"merged":[]}
[]
[]
[]
[]
[]
[]
[]
[]
[]
[]
{"$rows_left_out":8}